{"text_format":"1","workbook":"xlsx","n_sheets":23,"sheets":["SHELL","ZipLkup","Sheet1","ZIP-ZONES","LOOKUP","Ground Current","NDA Multi","ND Svr Multi","2DA Multi","2DA AM Multi","3DS Multi","GND E&I","PO E&I","SO E&I","E2AM","E2 E&I","ESP E&I","FX GND","FX PO","FX STD","Fx2DA AM","Fx2DAY Air","FxExpress Saver"],"not_rendered":{"charts":0,"images":5,"macros":1,"external_links":0,"defined_names":2,"comments":0,"pivot_tables":0},"unopened":[],"bounds":{"document_bytes":16777216,"sheet_cells":100000,"rows_first":2000,"rows_last":500,"rows_between":2000,"halvings":0,"cell_chars":16384,"cell_head_chars":4096},"cells_cut":0,"cells_raw":0,"read":"whole","date_system":"1900"}

{"sheet":"SHELL","index":0,"n_rows":30,"n_cols":12,"rows_kept":30,"cut":false,"hidden":false,"merged":[[0,0,1,12],[2,0,5,11]]}
["Cost Comparison FedEx E & I, UPS Contract, FedEx Contract Rates"]
[]
["Lowest Prices Highlighted in Yellow                           ** Services Not Available"]
[]
[]
[]
[]
[null,null,"Zone 2","Zone 6",null,"Zone 2","Zone 6",null,"Zone 2","Zone 6"]
["Priority",null,"FedEx",null,null,"UPS",null,null,"FedEx",null,"DHL"]
["Overnite",null,"E & I",null,null,"Contract",null,null,"Contract",null,"International"]
["Envelope",null,8.51,9.15,null,5.82,7.27,null,6.24,8.08,"**","**"]
["1 lb",null,8.8699999999999992,14.26,null,5.83,12.05,null,6.3,12.63,"**","**"]
["2 lb",null,8.8699999999999992,16.100000000000001,null,5.86,13.62,null,6.44,14.3,"**","**"]
[null,null,null,null,null,null,null,null,null,null,"**","**"]
["Std ",null,null,null,null,null,null,null,null,null,"**","**"]
["Overnite",null,null,null,null,null,null,null,null,null,"**","**"]
["Envelope",null,8.43,9.15,null,5.81,7.37,null,5.85,7.38,"**","**"]
["1 lb",null,8.8699999999999992,14.26,null,5.78,7.78,null,5.96,11.09,"**","**"]
["2 lb",null,8.8699999999999992,16.670000000000002,null,5.87,10.27,null,6.01,12.52,"**","**"]
[null,null,null,null,null,null,null,null,null,null,"**","**"]
["2 Day",null,null,null,null,null,null,null,null,null,"**","**"]
["Envelope",null,6.82,8.51,null,4.79,5.83,null,5.13,6.19,"**","**"]
["1 lb",null,6.82,8.33,null,4.8499999999999996,5.76,null,5.13,6.19,"**","**"]
["2 lb",null,6.82,9.2200000000000006,null,4.8499999999999996,6.36,null,5.13,6.94,"**","**"]
[null,null,null,null,null,null,null,null,null,null,"**","**"]
["International"]
["Priority"]
["Envelope",null,15.35,"ENGLAND",null,24.34,"ENGLAND",null,27.84,"ENGLAND",7.82,"ENGLAND"]
["1 lb",null,23.9,"ENGLAND",null,35.119999999999997,"ENGLAND",null,37.380000000000003,"ENGLAND",10.76,"ENGLAND"]
["2 lb",null,23.9,"ENGLAND",null,37.57,"ENGLAND",null,37.380000000000003,"ENGLAND",10.76,"ENGLAND"]

{"sheet":"ZipLkup","index":1,"n_rows":952,"n_cols":2,"rows_kept":952,"cut":false,"hidden":true,"merged":[]}
[4,6]
[5,6]
[6,5]
[7,5]
[9,5]
[10,6]
[11,6]
[12,6]
[13,6]
[14,6]
[15,6]
[16,6]
[17,6]
[18,6]
[19,6]
[20,6]
[21,6]
[22,6]
[23,6]
[24,6]
[25,6]
[26,6]
[27,6]
[28,6]
[29,6]
[30,6]
[31,6]
[32,6]
[33,6]
[34,6]
[35,6]
[36,6]
[37,6]
[38,6]
[39,6]
[40,6]
[41,6]
[42,6]
[43,6]
[44,7]
[45,6]
[46,7]
[47,7]
[48,7]
[49,6]
[50,6]
[51,6]
[52,6]
[53,6]
[54,6]
[55,6]
[56,6]
[57,6]
[58,6]
[59,6]
[60,6]
[61,6]
[62,6]
[63,6]
[64,6]
[65,6]
[66,6]
[67,6]
[68,6]
[69,6]
[70,6]
[71,6]
[72,6]
[73,6]
[74,6]
[75,6]
[76,6]
[77,6]
[78,6]
[79,6]
[80,6]
[81,6]
[82,6]
[83,6]
[84,6]
[85,6]
[86,6]
[87,6]
[88,6]
[89,6]
[100,6]
[101,6]
[102,6]
[103,6]
[104,6]
[105,6]
[106,6]
[107,6]
[108,6]
[109,6]
[110,6]
[111,6]
[112,6]
[113,6]
[114,6]
[115,6]
[116,6]
[117,6]
[118,6]
[119,6]
[120,6]
[121,6]
[122,6]
[123,6]
[124,6]
[125,6]
[126,6]
[127,6]
[128,6]
[129,6]
[130,6]
[131,6]
[132,6]
[133,6]
[134,6]
[135,6]
[136,6]
[137,6]
[138,6]
[139,6]
[140,5]
[141,5]
[142,5]
[143,5]
[144,5]
[145,5]
[146,5]
[147,5]
[148,6]
[149,6]
[150,5]
[151,5]
[152,5]
[153,5]
[154,5]
[155,5]
[156,5]
[157,5]
[158,5]
[159,5]
[160,5]
[161,5]
[162,5]
[163,5]
[164,5]
[165,5]
[166,5]
[167,5]
[168,5]
[169,5]
[170,5]
[171,5]
[172,5]
[173,5]
[174,5]
[175,5]
[176,5]
[177,5]
[178,5]
[179,6]
[180,6]
[181,6]
[182,6]
[183,6]
[184,6]
[185,6]
[186,6]
[187,6]
[188,6]
[189,6]
[190,6]
[191,6]
[192,6]
[193,6]
[194,6]
[195,6]
[196,6]
[197,6]
[198,6]
[199,6]
[200,5]
[201,5]
[202,5]
[203,5]
[204,5]
[205,5]
[206,5]
[207,5]
[208,5]
[209,5]
[210,5]
[211,5]
[212,5]
[213,5]
[214,5]
[215,5]
[216,5]
[217,5]
[218,6]
[219,6]
[220,5]
[221,5]
[222,5]
[223,5]
[224,5]
[225,5]
[226,5]
[227,5]
[228,5]
[229,5]
[230,5]
[231,5]
[232,5]
[233,5]
[234,5]
[235,5]
[236,5]
[237,5]
[238,5]
[239,5]
[240,5]
[241,5]
[242,5]
[243,5]
[244,5]
[245,5]
[246,5]
[247,5]
[248,5]
[249,5]
[250,5]
[251,5]
[252,5]
[253,5]
[254,5]
[255,5]
[256,5]
[257,5]
[258,5]
[259,5]
[260,5]
[261,5]
[262,5]
[263,5]
[264,5]
[265,5]
[266,5]
[267,5]
[268,5]
[269,5]
[270,5]
[271,5]
[272,5]
[273,5]
[274,5]
[275,5]
[276,5]
[277,5]
[278,5]
[279,5]
[280,5]
[281,5]
[282,5]
[283,5]
[284,5]
[285,5]
[286,5]
[287,5]
[288,5]
[289,4]
[290,5]
[291,5]
[292,5]
[293,5]
[294,5]
[295,5]
[296,5]
[297,5]
[298,5]
[299,5]
[300,4]
[301,4]
[302,4]
[303,4]
[304,5]
[305,4]
[306,5]
[307,4]
[308,5]
[309,5]
[310,5]
[311,4]
[312,5]
[313,5]
[314,5]
[315,5]
[316,5]
[317,5]
[318,4]
[319,4]
[320,5]
[321,5]
[322,5]
[323,5]
[324,5]
[325,4]
[326,5]
[327,5]
[328,5]
[329,5]
[330,6]
[331,6]
[332,6]
[333,6]
[334,6]
[335,5]
[336,5]
[337,5]
[338,5]
[339,5]
[341,5]
[342,5]
[343,5]
[344,5]
[345,5]
[346,5]
[347,5]
[349,6]
[350,4]
[351,4]
[352,4]
[353,4]
[354,4]
[355,4]
[356,4]
[357,4]
[358,4]
[359,4]
[360,4]
[361,4]
[362,4]
[363,4]
[364,4]
[365,4]
[366,4]
[367,4]
[368,4]
[369,4]
[370,4]
[371,4]
[372,4]
[373,4]
[374,4]
[375,3]
[376,5]
[377,4]
[378,4]
[379,4]
[380,3]
[381,3]
[382,3]
[383,3]
[384,4]
[385,4]
[386,3]
[387,3]
[388,4]
[389,3]
[390,4]
[391,4]
[392,4]
[393,4]
[394,4]
[395,4]
[396,4]
[397,4]
[398,5]
[399,4]
[400,4]
[401,4]
[402,4]
[403,4]
[404,4]
[405,4]
[406,4]
[407,4]
[408,4]
[409,4]
[410,4]
[411,5]
[412,5]
[413,4]
[414,4]
[415,5]
[416,5]
[417,4]
[418,4]
[420,3]
[421,4]
[422,4]
[423,4]
[424,4]
[425,4]
[426,4]
[427,4]
[430,5]
[431,5]
[432,5]
[433,5]
[434,5]
[435,5]
[436,5]
[437,5]
[438,5]
[439,5]
[440,5]
[441,5]
[442,5]
[443,5]
[444,5]
[445,5]
[446,5]
[447,5]
[448,5]
[449,5]
[450,4]
[451,4]
[452,4]
[453,4]
[454,4]
[455,5]
[456,5]
[457,5]
[458,5]
[459,4]
[460,4]
[461,4]
[462,4]
[463,4]
[464,4]
[465,4]
[466,4]
[467,4]
[468,4]
[469,4]
[470,4]
[471,4]
[472,4]
[473,4]
[474,4]
[475,4]
[476,4]
[477,4]
[478,4]
[479,4]
[480,5]
[481,5]
[482,5]
[483,5]
[484,5]
[485,5]
[486,5]
[487,5]
[488,5]
[489,5]
[490,4]
[491,4]
[492,5]
[493,5]
[494,5]
[495,5]
[496,5]
[497,5]
[498,5]
[499,5]
[500,4]
[501,4]
[502,4]
[503,4]
[504,4]
[505,4]
[506,4]
[507,4]
[508,4]
[509,4]
[510,4]
[511,4]
[512,4]
[513,4]
[514,4]
[515,4]
[516,3]
[520,4]
[521,4]
[522,4]
[523,4]
[524,4]
[525,4]
[526,4]
[527,4]
[528,4]
[529,4]
[530,4]
[531,4]
[532,4]
[533,4]
[534,4]
[535,4]
[536,4]
[537,4]
[538,4]
[539,4]
[540,4]
[541,5]
[542,5]
[543,5]
[544,5]
[545,5]
[546,4]
[547,4]
[548,5]
[549,5]
[550,4]
[551,4]
[552,4]
[553,4]
[554,4]
[555,4]
[556,5]
[557,5]
[558,5]
[559,4]
[560,4]
[561,4]
[562,5]
[563,5]
[564,5]
[565,5]
[566,5]
[567,5]
[570,4]
[571,4]
[572,4]
[573,4]
[574,5]
[575,5]
[576,5]
[577,5]
[578,5]
[579,5]
[580,5]
[581,5]
[582,5]
[583,5]
[584,5]
[585,5]
[586,5]
[587,5]
[588,5]
[589,5]
[590,5]
[591,5]
[592,5]
[593,5]
[594,6]
[595,6]
[596,6]
[597,6]
[598,6]
[599,6]
[600,4]
[601,4]
[602,4]
[603,4]
[604,4]
[605,4]
[606,4]
[607,4]
[608,4]
[609,4]
[610,4]
[611,4]
[612,4]
[613,4]
[614,4]
[615,4]
[616,4]
[617,4]
[618,4]
[619,4]
[620,3]
[621,3]
[622,3]
[623,3]
[624,4]
[625,4]
[626,4]
[627,4]
[628,4]
[629,3]
[630,3]
[631,3]
[632,3]
[633,3]
[634,3]
[635,3]
[636,3]
[637,3]
[638,3]
[639,3]
[640,3]
[641,3]
[642,3]
[643,3]
[644,3]
[645,3]
[646,3]
[647,3]
[648,2]
[649,3]
[650,3]
[651,3]
[652,3]
[653,3]
[654,3]
[655,3]
[656,2]
[657,2]
[658,2]
[659,2]
[660,3]
[661,3]
[662,3]
[663,3]
[664,3]
[665,3]
[666,3]
[667,2]
[668,3]
[669,3]
[670,3]
[671,3]
[672,3]
[673,2]
[674,3]
[675,3]
[676,4]
[677,4]
[678,4]
[679,4]
[680,4]
[681,4]
[682,4]
[683,4]
[684,4]
[685,4]
[686,4]
[687,4]
[688,4]
[689,4]
[690,4]
[691,4]
[692,4]
[693,4]
[694,4]
[695,4]
[696,4]
[697,4]
[698,4]
[699,4]
[700,4]
[701,4]
[702,4]
[703,4]
[704,4]
[705,4]
[706,4]
[707,4]
[708,4]
[709,4]
[710,3]
[711,3]
[712,3]
[713,4]
[714,4]
[716,3]
[717,3]
[718,3]
[719,2]
[720,2]
[721,2]
[722,2]
[723,3]
[724,3]
[725,2]
[726,2]
[727,2]
[728,2]
[729,2]
[730,3]
[731,3]
[732,3]
[733,4]
[734,3]
[735,3]
[736,3]
[737,3]
[738,3]
[739,4]
[740,2]
[741,2]
[742,2]
[743,2]
[744,2]
[745,2]
[746,3]
[747,3]
[748,2]
[749,2]
[750,3]
[751,3]
[752,3]
[753,3]
[754,3]
[755,3]
[756,3]
[757,3]
[758,4]
[759,4]
[760,3]
[761,3]
[762,3]
[763,3]
[764,3]
[765,4]
[766,4]
[767,4]
[768,4]
[769,4]
[770,4]
[771,4]
[772,4]
[773,4]
[774,4]
[775,4]
[776,4]
[777,4]
[778,4]
[779,4]
[780,4]
[781,4]
[782,4]
[783,4]
[784,4]
[785,5]
[786,4]
[787,4]
[788,4]
[789,4]
[790,4]
[791,4]
[792,4]
[793,4]
[794,4]
[795,4]
[796,4]
[797,4]
[798,5]
[799,5]
[800,5]
[801,5]
[802,5]
[803,5]
[804,5]
[805,5]
[806,5]
[807,4]
[808,4]
[809,4]
[810,4]
[811,5]
[812,5]
[813,5]
[814,5]
[815,5]
[816,5]
[817,5]
[818,5]
[819,5]
[820,5]
[821,5]
[822,5]
[823,5]
[824,5]
[825,5]
[826,5]
[827,5]
[828,5]
[829,5]
[830,5]
[831,5]
[832,6]
[833,6]
[834,6]
[835,6]
[836,6]
[837,6]
[838,6]
[840,5]
[841,5]
[842,5]
[843,5]
[844,5]
[845,5]
[846,5]
[847,5]
[850,6]
[851,6]
[852,5]
[853,6]
[854,6]
[855,5]
[856,5]
[857,5]
[858,5]
[859,5]
[860,5]
[863,6]
[864,6]
[865,5]
[866,5]
[867,5]
[868,5]
[869,5]
[870,5]
[871,5]
[872,5]
[873,5]
[874,5]
[875,5]
[876,5]
[877,5]
[878,5]
[879,5]
[880,5]
[881,4]
[882,5]
[883,5]
[884,4]
[885,5]
[889,6]
[890,6]
[891,6]
[892,6]
[893,6]
[894,6]
[895,6]
[896,6]
[897,6]
[898,6]
[899,6]
[900,6]
[901,6]
[902,6]
[903,6]
[904,6]
[905,6]
[906,6]
[907,6]
[908,6]
[909,6]
[910,6]
[911,6]
[912,6]
[913,6]
[914,6]
[915,6]
[916,6]
[917,6]
[918,6]
[919,6]
[920,6]
[921,6]
[922,6]
[923,6]
[924,6]
[925,6]
[926,6]
[927,6]
[928,6]
[929,6]
[930,6]
[931,7]
[932,6]
[933,6]
[934,7]
[935,6]
[936,6]
[937,6]
[938,6]
[939,7]
[940,7]
[941,7]
[942,7]
[943,7]
[944,7]
[945,7]
[946,7]
[947,7]
[948,7]
[949,7]
[950,7]
[951,7]
[952,7]
[953,7]
[954,7]
[955,7]
[956,7]
[957,7]
[958,7]
[959,7]
[960,7]
[961,6]
[970,7]
[971,7]
[972,7]
[973,7]
[974,7]
[975,7]
[976,7]
[977,7]
[978,7]
[979,6]
[980,7]
[981,7]
[982,7]
[983,7]
[984,7]
[985,7]
[986,7]
[988,7]
[989,7]
[990,6]
[991,6]
[992,6]
[993,7]
[994,6]

{"sheet":"Sheet1","index":2,"n_rows":952,"n_cols":4,"rows_kept":952,"cut":false,"hidden":true,"merged":[]}
[6,2,null,6]
[5,2,null,6]
[5,1,null,5]
[6,34,null,5]
[7,1,null,5]
[6,1,null,6]
[7,3,null,6]
[6,41,null,6]
[6,40,null,6]
[5,8,null,6]
[6,2,null,6]
[5,29,null,6]
[6,21,null,6]
[5,18,null,6]
[6,2,null,6]
[5,69,null,6]
[4,1,null,6]
[5,10,null,6]
[4,4,null,6]
[5,1,null,6]
[4,1,null,6]
[5,1,null,6]
[4,1,null,6]
[5,3,null,6]
[4,1,null,6]
[5,6,null,6]
[4,2,null,6]
[5,5,null,6]
[4,1,null,6]
[5,4,null,6]
[6,5,null,6]
[5,5,null,6]
[5,1,null,6]
[5,6,null,6]
[6,1,null,6]
[4,25,null,6]
[3,1,null,6]
[5,1,null,6]
[4,3,null,6]
[3,4,null,7]
[4,2,null,6]
[3,2,null,7]
[4,1,null,7]
[3,1,null,7]
[4,8,null,6]
[5,1,null,6]
[4,12,null,6]
[5,2,null,6]
[4,2,null,6]
[5,2,null,6]
[4,2,null,6]
[3,1,null,6]
[4,7,null,6]
[5,20,null,6]
[4,5,null,6]
[5,4,null,6]
[4,21,null,6]
[5,10,null,6]
[4,2,null,6]
[5,8,null,6]
[4,16,null,6]
[3,1,null,6]
[4,21,null,6]
[5,5,null,6]
[4,2,null,6]
[5,2,null,6]
[4,6,null,6]
[5,3,null,6]
[4,3,null,6]
[5,6,null,6]
[4,4,null,6]
[5,20,null,6]
[6,6,null,6]
[4,20,null,6]
[3,4,null,6]
[4,5,null,6]
[3,19,null,6]
[2,1,null,6]
[3,7,null,6]
[2,4,null,6]
[3,7,null,6]
[2,1,null,6]
[3,5,null,6]
[2,1,null,6]
[3,2,null,6]
[4,34,null,6]
[3,3,null,6]
[4,2,null,6]
[3,3,null,6]
[2,4,null,6]
[3,2,null,6]
[2,5,null,6]
[3,3,null,6]
[4,1,null,6]
[3,5,null,6]
[4,1,null,6]
[2,6,null,6]
[3,2,null,6]
[2,2,null,6]
[3,8,null,6]
[4,2,null,6]
[3,5,null,6]
[4,20,null,6]
[5,1,null,6]
[4,12,null,6]
[5,9,null,6]
[4,4,null,6]
[5,21,null,6]
[6,7,null,6]
[5,8,null,6]
[6,2,null,6]
[5,1,null,6]
[6,2,null,6]
[5,6,null,6]
[6,2,null,6]
[5,16,null,6]
[4,1,null,6]
[5,2,null,6]
[4,1,null,6]
[5,1,null,6]
[6,42,null,6]
[7,1,null,6]
[6,2,null,6]
[7,1,null,6]
[6,4,null,6]
[7,22,null,5]
[6,1,null,5]
[7,9,null,5]
[6,1,null,5]
[7,7,null,5]
[7,2,null,5]
[6,3,null,5]
[7,1,null,5]
[6,1,null,6]
[null,null,null,6]
[null,null,null,5]
[null,null,null,5]
[null,null,null,5]
[null,null,null,5]
[null,null,null,5]
[null,null,null,5]
[null,null,null,5]
[null,null,null,5]
[null,null,null,5]
[null,null,null,5]
[null,null,null,5]
[null,null,null,5]
[null,null,null,5]
[null,null,null,5]
[null,null,null,5]
[null,null,null,5]
[null,null,null,5]
[null,null,null,5]
[null,null,null,5]
[null,null,null,5]
[null,null,null,5]
[null,null,null,5]
[null,null,null,5]
[null,null,null,5]
[null,null,null,5]
[null,null,null,5]
[null,null,null,5]
[null,null,null,5]
[null,null,null,5]
[null,null,null,6]
[null,null,null,6]
[null,null,null,6]
[null,null,null,6]
[null,null,null,6]
[null,null,null,6]
[null,null,null,6]
[null,null,null,6]
[null,null,null,6]
[null,null,null,6]
[null,null,null,6]
[null,null,null,6]
[null,null,null,6]
[null,null,null,6]
[null,null,null,6]
[null,null,null,6]
[null,null,null,6]
[null,null,null,6]
[null,null,null,6]
[null,null,null,6]
[null,null,null,6]
[null,null,null,5]
[null,null,null,5]
[null,null,null,5]
[null,null,null,5]
[null,null,null,5]
[null,null,null,5]
[null,null,null,5]
[null,null,null,5]
[null,null,null,5]
[null,null,null,5]
[null,null,null,5]
[null,null,null,5]
[null,null,null,5]
[null,null,null,5]
[null,null,null,5]
[null,null,null,5]
[null,null,null,5]
[null,null,null,5]
[null,null,null,6]
[null,null,null,6]
[null,null,null,5]
[null,null,null,5]
[null,null,null,5]
[null,null,null,5]
[null,null,null,5]
[null,null,null,5]
[null,null,null,5]
[null,null,null,5]
[null,null,null,5]
[null,null,null,5]
[null,null,null,5]
[null,null,null,5]
[null,null,null,5]
[null,null,null,5]
[null,null,null,5]
[null,null,null,5]
[null,null,null,5]
[null,null,null,5]
[null,null,null,5]
[null,null,null,5]
[null,null,null,5]
[null,null,null,5]
[null,null,null,5]
[null,null,null,5]
[null,null,null,5]
[null,null,null,5]
[null,null,null,5]
[null,null,null,5]
[null,null,null,5]
[null,null,null,5]
[null,null,null,5]
[null,null,null,5]
[null,null,null,5]
[null,null,null,5]
[null,null,null,5]
[null,null,null,5]
[null,null,null,5]
[null,null,null,5]
[null,null,null,5]
[null,null,null,5]
[null,null,null,5]
[null,null,null,5]
[null,null,null,5]
[null,null,null,5]
[null,null,null,5]
[null,null,null,5]
[null,null,null,5]
[null,null,null,5]
[null,null,null,5]
[null,null,null,5]
[null,null,null,5]
[null,null,null,5]
[null,null,null,5]
[null,null,null,5]
[null,null,null,5]
[null,null,null,5]
[null,null,null,5]
[null,null,null,5]
[null,null,null,5]
[null,null,null,5]
[null,null,null,5]
[null,null,null,5]
[null,null,null,5]
[null,null,null,5]
[null,null,null,5]
[null,null,null,5]
[null,null,null,5]
[null,null,null,5]
[null,null,null,5]
[null,null,null,4]
[null,null,null,5]
[null,null,null,5]
[null,null,null,5]
[null,null,null,5]
[null,null,null,5]
[null,null,null,5]
[null,null,null,5]
[null,null,null,5]
[null,null,null,5]
[null,null,null,5]
[null,null,null,4]
[null,null,null,4]
[null,null,null,4]
[null,null,null,4]
[null,null,null,5]
[null,null,null,4]
[null,null,null,5]
[null,null,null,4]
[null,null,null,5]
[null,null,null,5]
[null,null,null,5]
[null,null,null,4]
[null,null,null,5]
[null,null,null,5]
[null,null,null,5]
[null,null,null,5]
[null,null,null,5]
[null,null,null,5]
[null,null,null,4]
[null,null,null,4]
[null,null,null,5]
[null,null,null,5]
[null,null,null,5]
[null,null,null,5]
[null,null,null,5]
[null,null,null,4]
[null,null,null,5]
[null,null,null,5]
[null,null,null,5]
[null,null,null,5]
[null,null,null,6]
[null,null,null,6]
[null,null,null,6]
[null,null,null,6]
[null,null,null,6]
[null,null,null,5]
[null,null,null,5]
[null,null,null,5]
[null,null,null,5]
[null,null,null,5]
[null,null,null,5]
[null,null,null,5]
[null,null,null,5]
[null,null,null,5]
[null,null,null,5]
[null,null,null,5]
[null,null,null,5]
[null,null,null,6]
[null,null,null,4]
[null,null,null,4]
[null,null,null,4]
[null,null,null,4]
[null,null,null,4]
[null,null,null,4]
[null,null,null,4]
[null,null,null,4]
[null,null,null,4]
[null,null,null,4]
[null,null,null,4]
[null,null,null,4]
[null,null,null,4]
[null,null,null,4]
[null,null,null,4]
[null,null,null,4]
[null,null,null,4]
[null,null,null,4]
[null,null,null,4]
[null,null,null,4]
[null,null,null,4]
[null,null,null,4]
[null,null,null,4]
[null,null,null,4]
[null,null,null,4]
[null,null,null,3]
[null,null,null,5]
[null,null,null,4]
[null,null,null,4]
[null,null,null,4]
[null,null,null,3]
[null,null,null,3]
[null,null,null,3]
[null,null,null,3]
[null,null,null,4]
[null,null,null,4]
[null,null,null,3]
[null,null,null,3]
[null,null,null,4]
[null,null,null,3]
[null,null,null,4]
[null,null,null,4]
[null,null,null,4]
[null,null,null,4]
[null,null,null,4]
[null,null,null,4]
[null,null,null,4]
[null,null,null,4]
[null,null,null,5]
[null,null,null,4]
[null,null,null,4]
[null,null,null,4]
[null,null,null,4]
[null,null,null,4]
[null,null,null,4]
[null,null,null,4]
[null,null,null,4]
[null,null,null,4]
[null,null,null,4]
[null,null,null,4]
[null,null,null,4]
[null,null,null,5]
[null,null,null,5]
[null,null,null,4]
[null,null,null,4]
[null,null,null,5]
[null,null,null,5]
[null,null,null,4]
[null,null,null,4]
[null,null,null,3]
[null,null,null,4]
[null,null,null,4]
[null,null,null,4]
[null,null,null,4]
[null,null,null,4]
[null,null,null,4]
[null,null,null,4]
[null,null,null,5]
[null,null,null,5]
[null,null,null,5]
[null,null,null,5]
[null,null,null,5]
[null,null,null,5]
[null,null,null,5]
[null,null,null,5]
[null,null,null,5]
[null,null,null,5]
[null,null,null,5]
[null,null,null,5]
[null,null,null,5]
[null,null,null,5]
[null,null,null,5]
[null,null,null,5]
[null,null,null,5]
[null,null,null,5]
[null,null,null,5]
[null,null,null,5]
[null,null,null,4]
[null,null,null,4]
[null,null,null,4]
[null,null,null,4]
[null,null,null,4]
[null,null,null,5]
[null,null,null,5]
[null,null,null,5]
[null,null,null,5]
[null,null,null,4]
[null,null,null,4]
[null,null,null,4]
[null,null,null,4]
[null,null,null,4]
[null,null,null,4]
[null,null,null,4]
[null,null,null,4]
[null,null,null,4]
[null,null,null,4]
[null,null,null,4]
[null,null,null,4]
[null,null,null,4]
[null,null,null,4]
[null,null,null,4]
[null,null,null,4]
[null,null,null,4]
[null,null,null,4]
[null,null,null,4]
[null,null,null,4]
[null,null,null,4]
[null,null,null,5]
[null,null,null,5]
[null,null,null,5]
[null,null,null,5]
[null,null,null,5]
[null,null,null,5]
[null,null,null,5]
[null,null,null,5]
[null,null,null,5]
[null,null,null,5]
[null,null,null,4]
[null,null,null,4]
[null,null,null,5]
[null,null,null,5]
[null,null,null,5]
[null,null,null,5]
[null,null,null,5]
[null,null,null,5]
[null,null,null,5]
[null,null,null,5]
[null,null,null,4]
[null,null,null,4]
[null,null,null,4]
[null,null,null,4]
[null,null,null,4]
[null,null,null,4]
[null,null,null,4]
[null,null,null,4]
[null,null,null,4]
[null,null,null,4]
[null,null,null,4]
[null,null,null,4]
[null,null,null,4]
[null,null,null,4]
[null,null,null,4]
[null,null,null,4]
[null,null,null,3]
[null,null,null,4]
[null,null,null,4]
[null,null,null,4]
[null,null,null,4]
[null,null,null,4]
[null,null,null,4]
[null,null,null,4]
[null,null,null,4]
[null,null,null,4]
[null,null,null,4]
[null,null,null,4]
[null,null,null,4]
[null,null,null,4]
[null,null,null,4]
[null,null,null,4]
[null,null,null,4]
[null,null,null,4]
[null,null,null,4]
[null,null,null,4]
[null,null,null,4]
[null,null,null,4]
[null,null,null,5]
[null,null,null,5]
[null,null,null,5]
[null,null,null,5]
[null,null,null,5]
[null,null,null,4]
[null,null,null,4]
[null,null,null,5]
[null,null,null,5]
[null,null,null,4]
[null,null,null,4]
[null,null,null,4]
[null,null,null,4]
[null,null,null,4]
[null,null,null,4]
[null,null,null,5]
[null,null,null,5]
[null,null,null,5]
[null,null,null,4]
[null,null,null,4]
[null,null,null,4]
[null,null,null,5]
[null,null,null,5]
[null,null,null,5]
[null,null,null,5]
[null,null,null,5]
[null,null,null,5]
[null,null,null,4]
[null,null,null,4]
[null,null,null,4]
[null,null,null,4]
[null,null,null,5]
[null,null,null,5]
[null,null,null,5]
[null,null,null,5]
[null,null,null,5]
[null,null,null,5]
[null,null,null,5]
[null,null,null,5]
[null,null,null,5]
[null,null,null,5]
[null,null,null,5]
[null,null,null,5]
[null,null,null,5]
[null,null,null,5]
[null,null,null,5]
[null,null,null,5]
[null,null,null,5]
[null,null,null,5]
[null,null,null,5]
[null,null,null,5]
[null,null,null,6]
[null,null,null,6]
[null,null,null,6]
[null,null,null,6]
[null,null,null,6]
[null,null,null,6]
[null,null,null,4]
[null,null,null,4]
[null,null,null,4]
[null,null,null,4]
[null,null,null,4]
[null,null,null,4]
[null,null,null,4]
[null,null,null,4]
[null,null,null,4]
[null,null,null,4]
[null,null,null,4]
[null,null,null,4]
[null,null,null,4]
[null,null,null,4]
[null,null,null,4]
[null,null,null,4]
[null,null,null,4]
[null,null,null,4]
[null,null,null,4]
[null,null,null,4]
[null,null,null,3]
[null,null,null,3]
[null,null,null,3]
[null,null,null,3]
[null,null,null,4]
[null,null,null,4]
[null,null,null,4]
[null,null,null,4]
[null,null,null,4]
[null,null,null,3]
[null,null,null,3]
[null,null,null,3]
[null,null,null,3]
[null,null,null,3]
[null,null,null,3]
[null,null,null,3]
[null,null,null,3]
[null,null,null,3]
[null,null,null,3]
[null,null,null,3]
[null,null,null,3]
[null,null,null,3]
[null,null,null,3]
[null,null,null,3]
[null,null,null,3]
[null,null,null,3]
[null,null,null,3]
[null,null,null,3]
[null,null,null,2]
[null,null,null,3]
[null,null,null,3]
[null,null,null,3]
[null,null,null,3]
[null,null,null,3]
[null,null,null,3]
[null,null,null,3]
[null,null,null,2]
[null,null,null,2]
[null,null,null,2]
[null,null,null,2]
[null,null,null,3]
[null,null,null,3]
[null,null,null,3]
[null,null,null,3]
[null,null,null,3]
[null,null,null,3]
[null,null,null,3]
[null,null,null,2]
[null,null,null,3]
[null,null,null,3]
[null,null,null,3]
[null,null,null,3]
[null,null,null,3]
[null,null,null,2]
[null,null,null,3]
[null,null,null,3]
[null,null,null,4]
[null,null,null,4]
[null,null,null,4]
[null,null,null,4]
[null,null,null,4]
[null,null,null,4]
[null,null,null,4]
[null,null,null,4]
[null,null,null,4]
[null,null,null,4]
[null,null,null,4]
[null,null,null,4]
[null,null,null,4]
[null,null,null,4]
[null,null,null,4]
[null,null,null,4]
[null,null,null,4]
[null,null,null,4]
[null,null,null,4]
[null,null,null,4]
[null,null,null,4]
[null,null,null,4]
[null,null,null,4]
[null,null,null,4]
[null,null,null,4]
[null,null,null,4]
[null,null,null,4]
[null,null,null,4]
[null,null,null,4]
[null,null,null,4]
[null,null,null,4]
[null,null,null,4]
[null,null,null,4]
[null,null,null,4]
[null,null,null,3]
[null,null,null,3]
[null,null,null,3]
[null,null,null,4]
[null,null,null,4]
[null,null,null,3]
[null,null,null,3]
[null,null,null,3]
[null,null,null,2]
[null,null,null,2]
[null,null,null,2]
[null,null,null,2]
[null,null,null,3]
[null,null,null,3]
[null,null,null,2]
[null,null,null,2]
[null,null,null,2]
[null,null,null,2]
[null,null,null,2]
[null,null,null,3]
[null,null,null,3]
[null,null,null,3]
[null,null,null,4]
[null,null,null,3]
[null,null,null,3]
[null,null,null,3]
[null,null,null,3]
[null,null,null,3]
[null,null,null,4]
[null,null,null,2]
[null,null,null,2]
[null,null,null,2]
[null,null,null,2]
[null,null,null,2]
[null,null,null,2]
[null,null,null,3]
[null,null,null,3]
[null,null,null,2]
[null,null,null,2]
[null,null,null,3]
[null,null,null,3]
[null,null,null,3]
[null,null,null,3]
[null,null,null,3]
[null,null,null,3]
[null,null,null,3]
[null,null,null,3]
[null,null,null,4]
[null,null,null,4]
[null,null,null,3]
[null,null,null,3]
[null,null,null,3]
[null,null,null,3]
[null,null,null,3]
[null,null,null,4]
[null,null,null,4]
[null,null,null,4]
[null,null,null,4]
[null,null,null,4]
[null,null,null,4]
[null,null,null,4]
[null,null,null,4]
[null,null,null,4]
[null,null,null,4]
[null,null,null,4]
[null,null,null,4]
[null,null,null,4]
[null,null,null,4]
[null,null,null,4]
[null,null,null,4]
[null,null,null,4]
[null,null,null,4]
[null,null,null,4]
[null,null,null,4]
[null,null,null,5]
[null,null,null,4]
[null,null,null,4]
[null,null,null,4]
[null,null,null,4]
[null,null,null,4]
[null,null,null,4]
[null,null,null,4]
[null,null,null,4]
[null,null,null,4]
[null,null,null,4]
[null,null,null,4]
[null,null,null,4]
[null,null,null,5]
[null,null,null,5]
[null,null,null,5]
[null,null,null,5]
[null,null,null,5]
[null,null,null,5]
[null,null,null,5]
[null,null,null,5]
[null,null,null,5]
[null,null,null,4]
[null,null,null,4]
[null,null,null,4]
[null,null,null,4]
[null,null,null,5]
[null,null,null,5]
[null,null,null,5]
[null,null,null,5]
[null,null,null,5]
[null,null,null,5]
[null,null,null,5]
[null,null,null,5]
[null,null,null,5]
[null,null,null,5]
[null,null,null,5]
[null,null,null,5]
[null,null,null,5]
[null,null,null,5]
[null,null,null,5]
[null,null,null,5]
[null,null,null,5]
[null,null,null,5]
[null,null,null,5]
[null,null,null,5]
[null,null,null,5]
[null,null,null,6]
[null,null,null,6]
[null,null,null,6]
[null,null,null,6]
[null,null,null,6]
[null,null,null,6]
[null,null,null,6]
[null,null,null,5]
[null,null,null,5]
[null,null,null,5]
[null,null,null,5]
[null,null,null,5]
[null,null,null,5]
[null,null,null,5]
[null,null,null,5]
[null,null,null,6]
[null,null,null,6]
[null,null,null,5]
[null,null,null,6]
[null,null,null,6]
[null,null,null,5]
[null,null,null,5]
[null,null,null,5]
[null,null,null,5]
[null,null,null,5]
[null,null,null,5]
[null,null,null,6]
[null,null,null,6]
[null,null,null,5]
[null,null,null,5]
[null,null,null,5]
[null,null,null,5]
[null,null,null,5]
[null,null,null,5]
[null,null,null,5]
[null,null,null,5]
[null,null,null,5]
[null,null,null,5]
[null,null,null,5]
[null,null,null,5]
[null,null,null,5]
[null,null,null,5]
[null,null,null,5]
[null,null,null,5]
[null,null,null,4]
[null,null,null,5]
[null,null,null,5]
[null,null,null,4]
[null,null,null,5]
[null,null,null,6]
[null,null,null,6]
[null,null,null,6]
[null,null,null,6]
[null,null,null,6]
[null,null,null,6]
[null,null,null,6]
[null,null,null,6]
[null,null,null,6]
[null,null,null,6]
[null,null,null,6]
[null,null,null,6]
[null,null,null,6]
[null,null,null,6]
[null,null,null,6]
[null,null,null,6]
[null,null,null,6]
[null,null,null,6]
[null,null,null,6]
[null,null,null,6]
[null,null,null,6]
[null,null,null,6]
[null,null,null,6]
[null,null,null,6]
[null,null,null,6]
[null,null,null,6]
[null,null,null,6]
[null,null,null,6]
[null,null,null,6]
[null,null,null,6]
[null,null,null,6]
[null,null,null,6]
[null,null,null,6]
[null,null,null,6]
[null,null,null,6]
[null,null,null,6]
[null,null,null,6]
[null,null,null,6]
[null,null,null,6]
[null,null,null,6]
[null,null,null,6]
[null,null,null,6]
[null,null,null,7]
[null,null,null,6]
[null,null,null,6]
[null,null,null,7]
[null,null,null,6]
[null,null,null,6]
[null,null,null,6]
[null,null,null,6]
[null,null,null,7]
[null,null,null,7]
[null,null,null,7]
[null,null,null,7]
[null,null,null,7]
[null,null,null,7]
[null,null,null,7]
[null,null,null,7]
[null,null,null,7]
[null,null,null,7]
[null,null,null,7]
[null,null,null,7]
[null,null,null,7]
[null,null,null,7]
[null,null,null,7]
[null,null,null,7]
[null,null,null,7]
[null,null,null,7]
[null,null,null,7]
[null,null,null,7]
[null,null,null,7]
[null,null,null,7]
[null,null,null,6]
[null,null,null,7]
[null,null,null,7]
[null,null,null,7]
[null,null,null,7]
[null,null,null,7]
[null,null,null,7]
[null,null,null,7]
[null,null,null,7]
[null,null,null,7]
[null,null,null,6]
[null,null,null,7]
[null,null,null,7]
[null,null,null,7]
[null,null,null,7]
[null,null,null,7]
[null,null,null,7]
[null,null,null,7]
[null,null,null,7]
[null,null,null,7]
[null,null,null,6]
[null,null,null,6]
[null,null,null,6]
[null,null,null,7]
[null,null,null,6]

{"sheet":"ZIP-ZONES","index":3,"n_rows":209,"n_cols":6,"rows_kept":209,"cut":false,"hidden":true,"merged":[]}
["FEDEXGND ZIP-ZONES",null,null,null,"UPS ZIP-ZONES"]
[]
["000-004",6,null,null,"004-005",6]
["005",6,null,null,"006-007",5]
["010-043",6,null,null,"009",5]
["044",7,null,null,"010-043",6]
["045",6,null,null,"044",7]
["046-048",7,null,null,45,6]
["049-139",6,null,null,"046-048",7]
["140-147",5,null,null,"049-089",6]
["148-149",6,null,null,"100-139",6]
["150-178",5,null,null,"140-147",5]
["179-199",6,null,null,"148-149",6]
["200-212",5,null,null,"150-178",5]
[213,5,null,null,"179-199",6]
["214-217",5,null,null,"200-217",5]
["218-219",6,null,null,"218-219",6]
["220-268",5,null,null,"220-288",5]
[269,5,null,null,"289",4]
["270-288",5,null,null,"290-299",5]
[289,4,null,null,"300-303",4]
["290-299",5,null,null,"304",5]
["300-303",4,null,null,"305",4]
[304,5,null,null,"306",5]
[305,4,null,null,"307",4]
[306,5,null,null,"308-310",5]
[307,4,null,null,"311",4]
["308-310",5,null,null,"312-317",5]
[311,4,null,null,"318-319",4]
["312-317",5,null,null,"320-324",5]
["318-319",4,null,null,"325",4]
["320-324",5,null,null,"326-329",5]
[325,4,null,null,"330-334",6]
["326-329",5,null,null,"335-339",5]
["330-334",6,null,null,"341",5]
["335-339",5,null,null,"342-347",5]
[340,6,null,null,"349",6]
["341-342",5,null,null,"350-374",4]
[343,5,null,null,"375",3]
[344,5,null,null,"376",5]
[345,5,null,null,"377-379",4]
["346-347",5,null,null,"380-383",3]
[348,0,null,null,"384-385",4]
[349,6,null,null,"386-387",3]
["350-352",4,null,null,"388",4]
[353,0,null,null,"389",3]
["354-374",4,null,null,"390-397",4]
[375,3,null,null,"398",5]
[376,5,null,null,"399-410",4]
["377-379",4,null,null,"411-412",5]
["380-383",3,null,null,"413-414",4]
["384-385",4,null,null,"415-416",5]
["386-387",3,null,null,"417-418",4]
[388,4,null,null,420,3]
[389,3,null,null,"421-427",4]
["390-397",4,null,null,"430-449",5]
[398,5,null,null,"450-454",4]
["399-410",4,null,null,"455-458",5]
["411-412",5,null,null,"459-479",4]
["413-414",4,null,null,"480-489",5]
["415-416",5,null,null,"490-491",4]
["417-418",4,null,null,"492-499",5]
[419,0,null,null,"500-515",4]
[420,3,null,null,"516",3]
["421-427",4,null,null,"520-540",4]
["428-429",0,null,null,"541-545",5]
["430-449",5,null,null,"546-547",4]
["450-454",4,null,null,"548-549",5]
["455-458",5,null,null,"550-555",4]
["459-479",4,null,null,"556-558",5]
["480-489",5,null,null,"559-561",4]
["490-491",4,null,null,"562-567",5]
["492-499",5,null,null,"570-573",4]
["500-515",4,null,null,"574-593",5]
[516,3,null,null,"594-599",6]
["517-519",0,null,null,"600-619",4]
["520-528",4,null,null,"620-623",3]
[529,0,null,null,"624-628",4]
["530-532",4,null,null,"629-647",3]
[533,0,null,null,"648",2]
["534-535",4,null,null,"649-655",3]
[536,"NA",null,null,"656-659",2]
["537-540",4,null,null,"660-666",3]
["541-545",5,null,null,"667",2]
["546-547",4,null,null,"668-672",3]
["548-549",5,null,null,"673",2]
["550-551",4,null,null,"674-675",3]
[552,"NA",null,null,"676-709",4]
["553-555",4,null,null,"710-712",3]
["556-558",5,null,null,"713-714",4]
["559-561",4,null,null,"716-718",3]
["562-567",5,null,null,"719-722",2]
["568-569","NA",null,null,"723-724",3]
["570-573",4,null,null,"725-729",2]
["574-577",5,null,null,"730-732",3]
["578-579","NA",null,null,733,4]
["580-588",5,null,null,"734-738",3]
[589,"NA",null,null,"739",4]
["590-593",5,null,null,"740-745",2]
["594-599",6,null,null,"746-747",3]
["600-619",4,null,null,"748-749",2]
[620,3,null,null,"750-757",3]
[621,"NA",null,null,"758-759",4]
["622-623",3,null,null,"760-764",3]
["624-628",4,null,null,"765-784",4]
["629-631",3,null,null,"785",5]
[632,"NA",null,null,"786-797",4]
["633-641",3,null,null,"798-806",5]
["642-643","NA",null,null,"807-810",4]
["644-647",3,null,null,"811-831",5]
[648,2,null,null,"832-838",6]
["649-655",3,null,null,"840-847",5]
["656-658",2,null,null,"850-851",6]
[659,"NA",null,null,"852",5]
["660-662",3,null,null,"853-854",6]
[663,"NA",null,null,"855-860",5]
["664-666",3,null,null,"863-864",6]
[667,2,null,null,"865-880",5]
["668-672",3,null,null,"881",4]
[673,2,null,null,"882-883",5]
["674-675",3,null,null,"884",4]
["676-681",4,null,null,"885",5]
[682,"NA",null,null,"889-930",6]
["683-693",4,null,null,"931",7]
["694-699","NA",null,null,"932-933",6]
["700-701",4,null,null,"934",7]
[702,"NA",null,null,"935-938",6]
["703-708",4,null,null,"939-960",7]
[709,"NA",null,null,"961",6]
["710-712",3,null,null,"970-978",7]
["713-714",4,null,null,"979",6]
[715,"NA",null,null,"980-986",7]
["716-718",3,null,null,"988-989",7]
["719-722",2,null,null,"990-992",6]
["723-724",3,null,null,"993",7]
["725-729",2,null,null,"994",6]
["730-731",3]
[732,"NA"]
[733,4]
["734-738",3]
[739,4]
["740-741",2]
[742,"NA"]
["743-745",2]
["746-747",3]
["748-749",2]
[null,2]
["750-757",3]
[null,3]
["758-759",4]
["760-764",3]
["765-784",4]
[785,5]
["786-797",4]
["798-806",5]
["807-810",4]
["811-816",5]
["817-819","NA"]
["820-831",5]
["832-838",6]
[839,"NA"]
["840-847",5]
["848-849","NA"]
[850,6]
[851,6]
[852,5]
[853,6]
[854,"NA"]
["855-857",5]
[858,"NA"]
["859-860",5]
["861-862","NA"]
["863-864",6]
[865,5]
["866-869","NA"]
["870-875",5]
[876,"NA"]
["877-880",5]
[881,4]
["882-883",5]
[884,4]
[885,5]
["886-888","NA"]
["889-891",6]
[892,"NA"]
["893-895",6]
[896,"NA"]
["897-898",6]
[899,"NA"]
["900-908",6]
[909,"NA"]
["910-928",6]
[929,"NA"]
[930,6]
[931,7]
["932-933",6]
[934,7]
["935-938",6]
["939-960",7]
[961,6]
["962-966",7]
["970-978",7]
[979,6]
["980-986",7]
[987,"NA"]
["988-989",7]
["990-992",6]
[993,7]
[994,6]

{"sheet":"LOOKUP","index":4,"n_rows":36,"n_cols":16,"rows_kept":36,"cut":false,"hidden":false,"merged":[[0,7,3,15],[24,13,27,13],[30,0,30,6]]}
[null,null,null,null,null,null,null,"Ups, Fedex E & I and Fedex Contract Rate Comparision are Basic Rates. Not included are Extended Area Surcharge, Fuel Surcharge or Additional Handling charges.                                                                                                            UPS and Fedex Zone Charts are for Days in Transit Comparision Only."]
[]
["Invalid = Service not available"]
[]
["USE 1ST 3 NO. OF ZIP CODE",727]
["INPUT Weight",1,"Letter = .5"]
["UPS Zone",{"$f":"INDEX('ZIP-ZONES'!$F$3:$F$136,MATCH($B$5,0+LEFT('ZIP-ZONES'!$E$3:$E$136,3),1))","v":2}]
["FEDEX ZONE",{"$f":"INDEX('ZIP-ZONES'!$B$3:$B$209,MATCH($B$5,0+LEFT('ZIP-ZONES'!$A$3:$A$209,3),1))","v":2}]
[null,{"$f":"IFERROR(IF(B6>=F17,VLOOKUP(B6,'Ground Current'!A7:K156,B7),VLOOKUP(F17,'Ground Current'!A7:K156,B7)),\"**\")","v":3.5394000000000001},{"$f":"IFERROR(IF(B6>=F17,VLOOKUP(B6,'NDA Multi'!A6:K156,B7),VLOOKUP(F17,'NDA Multi'!A6:K156,B7)),\"**\")","v":5.8343999999999996},{"$f":"IFERROR(IF((B6>=F17),VLOOKUP(B6,'ND Svr Multi'!A6:H156,B7),VLOOKUP(F17,'ND Svr Multi'!J6:Q156,B7)),\"**\")","v":5.7834000000000003},{"$f":"IFERROR(IF((B6>=F17),VLOOKUP(B6,'2DA AM Multi'!A6:H156,B7),VLOOKUP(F17,'2DA AM Multi'!A6:H156,B7)),\"**\")","v":5.6916000000000002},{"$f":"IFERROR(IF(B6>=F17,VLOOKUP(B6,'2DA Multi'!A6:K156,B7),VLOOKUP(F17,'2DA Multi'!A6:K156,B7)),\"**\")","v":4.8449999999999998},{"$f":"IFERROR(IF(B6>=F17,VLOOKUP(B6,'3DS Multi'!A7:H156,B7),VLOOKUP(F17,'3DS Multi'!A7:H156,B7)),\"**\")","v":4.7940000000000005}]
["UPS RATES","GND","NDA","ND Svr","2DA AM","2 DA","3DS"]
["Comm",{"$f":"B9","v":3.5394000000000001},5.8343999999999996,5.7834000000000003,5.6916000000000002,4.8449999999999998,4.7940000000000005]
["Residental",{"$f":"B13","v":4.8794000000000004},{"$f":"C13","v":7.4243999999999994},{"$f":"D13","v":7.3734000000000002},{"$f":" E13","v":"**"},{"$f":"F13","v":6.4349999999999996},{"$f":"G13","v":6.3840000000000003}]
[null,{"$f":"IFERROR(IF(B6>=F17,VLOOKUP(B6,'Ground Current'!M7:T156,B7),VLOOKUP(F17,'Ground Current'!M7:T156,B7)),\"**\")","v":4.8794000000000004},{"$f":"IFERROR(IF(B6>=F17,VLOOKUP(B6,'NDA Multi'!M6:T156,B7),VLOOKUP(F17,'NDA Multi'!M6:T156,B7)),\"**\")","v":7.4243999999999994},{"$f":"IFERROR(IF(B6>=F17,VLOOKUP(B6,'ND Svr Multi'!J6:Q156,B7),VLOOKUP(F17,'ND Svr Multi'!J6:TQ156,B7)),\"**\")","v":7.3734000000000002},{"$f":"\"**\"","v":"**"},{"$f":"IFERROR(IF(B6>=F17,VLOOKUP(B6,'2DA Multi'!M6:T156,B7),VLOOKUP(F17,'2DA Multi'!M6:T156,B7)),\"**\")","v":6.4349999999999996},{"$f":"IFERROR(IF(B6>=F17,VLOOKUP(B6,'3DS Multi'!J7:Q156,B7),VLOOKUP(F17,'3DS Multi'!J7:Q156,B7)),\"**\")","v":6.3840000000000003}]
[]
["Dimensional Weight",null,null,null,"Cubic","Dimensonal"]
["Calculator","Length","Width","Height","Inches","Weight"]
["Enter Measurements",1,1,1,{"$f":"B17*C17*D17","v":1},{"$f":"ROUND(IF(E17>=1728,E17/139,E17/166),0)","v":0}]
[]
["If True Weight is above Dimensonal Weight Use True Weight"]
["If True Weight is below you must Use Dimensonal Weight "]
[]
["Fedex E & I RATES","GND","PO","SO","E2AM","E2","ESP",null,null,"BEST RATE","GND","PO","SO","E2AM","E2","ESP"]
["Cost",{"$f":"IFERROR(VLOOKUP(B6,'GND E&I'!A11:H60,B7,'GND E&I'!B10:H10),\"Invalid\")","v":6.36},{"$f":"VLOOKUP(B6,'PO E&I'!A6:H50,B7,'PO E&I'!B5:H5)","v":8.870000000000001},{"$f":"VLOOKUP(B6,'SO E&I'!A7:H59,B7,'SO E&I'!B6:H6)","v":8.6100000000000012},{"$f":"VLOOKUP(B6,E2AM!A14:H50,B7,E2AM!B13:I13)","v":9.6700000000000017},{"$f":"VLOOKUP(B6,'E2 E&I'!A14:H50,'E2 E&I'!B13:P13)","v":8.33},{"$f":"IFERROR(VLOOKUP(B6,'ESP E&I'!A14:H50,B7,'ESP E&I'!B13:H13),\"Invalid\")","v":6},null,null,"COMM",{"$f":"IFERROR(IFS(B11<G23,(\"UPS  \"& \"$\"& ROUND(B11,2)),\"FEDEX  \"& \"$\"& G23,\"No Rate\"),IF(B11<G27,(\"UPS  \"& \"$\"& ROUND(B11,2)),IF(B11>G27,\"FEDEX  \"& \"$\"& G27,\"No Rate\")))","v":"UPS  $3.54"},{"$f":"IF(C11<C23,\"UPS  \"& \"$\"& ROUND(C11,2),\"FEDEX  \"& \"$\"& ROUND(C23,2))","v":"UPS  $5.83"},{"$f":"IF(D11<D23,\"UPS  \"& \"$\"& ROUND(D11,2),\"FEDEX  \"& \"$\"& ROUND(D23,2))","v":"UPS  $5.78"},{"$f":"IF(E11<E23,\"UPS  \"& \"$\"& ROUND(E11,2),\"FEDEX  \"& \"$\"& ROUND(E23,2))","v":"UPS  $5.69"},{"$f":"IF(F11<F23,\"UPS  \"& \"$\"& ROUND(F11,2),\"FEDEX  \"& \"$\"& ROUND(F23,2))","v":"UPS  $4.85"},{"$f":"IF(G11<F23,\"UPS  \"& \"$\"& ROUND(G11,2),\"FEDEX  \"& \"$\"& ROUND(E23,2))","v":"UPS  $4.79"}]
["Residental",{"$f":"IFERROR((B23 + 3.85),\"Invalid\")","v":10.210000000000001},{"$f":"C23+3.85","v":12.72},{"$f":"D23+3.85","v":12.46},{"$f":"E23+3.85","v":13.520000000000001},{"$f":"F23+3.85","v":12.18},{"$f":"IFERROR((G23+3.85),\"Invalid\")","v":9.85},null,null,"RESIDENTAL",{"$f":"IFERROR(IFS(B12<B24,(\"UPS  \"& \"$\"& ROUND(B12,2)),\"FEDEX  \"& \"$\"& B24,\"No Rate\"),IF(B12<B24,(\"UPS  \"& \"$\"& ROUND(B12,2)),IF(B12>B28,\"FEDEX  \"& \"$\"& B28,\"No Rate\")))","v":"UPS  $4.88"},{"$f":"IF(C12<C24,\"UPS  \"& \"$\"& ROUND(C12,2),\"FEDEX  \"& \"$\"& ROUND(C24,2))","v":"UPS  $7.42"},{"$f":"IF(D12<D24,\"UPS  \"& \"$\"& ROUND(D12,2),\"FEDEX  \"& \"$\"& ROUND(D24,2))","v":"UPS  $7.37"},{"$f":"IF(E12<E24,\"UPS  \"& \"$\"& ROUND(F12,2),\"FEDEX E&I \"& \"$\"& ROUND(E24,2))","v":"FEDEX E&I $13.52"},{"$f":"IF(F12<F24,\"UPS  \"&\"$\"&ROUND(F12,2),\"FEDEX  \"&\"$\"&ROUND(F24,2))","v":"UPS  $6.44"},{"$f":"IFERROR(IF(G12<F24,\"UPS  \"&\"$\"&ROUND(G12,2),\"FEDEX  \"&\"$\"&ROUND(E24,2)),\"Invalid\")","v":"UPS  $6.38"}]
[null,{"$f":"IF(B6>=F17,VLOOKUP(B6,'FX GND'!A7:H156,B8),VLOOKUP(F17,'FX GND'!A7:H156,B8))","v":3.7},{"$f":"IF(B6>=F17,VLOOKUP(B6,'FX PO'!A8:H60,B8),VLOOKUP(F17,'FX PO'!A8:H60,B8))","v":6.3},{"$f":"IF(B6>=F17,VLOOKUP(B6,'FX STD'!A7:H59,B8),VLOOKUP(F17,'FX STD'!A7:H59,B8))","v":5.96},{"$f":"IF(B6>=F17,VLOOKUP(B6,'Fx2DA AM'!A30:M182,B8),VLOOKUP(F17,'Fx2DA AM'!A30:M182,B8))","v":5.71},{"$f":"IF(B6>=F17,VLOOKUP(B6,'Fx2DAY Air'!A7:H59,B8),VLOOKUP(F17,'Fx2DAY Air'!A7:H59,B8))","v":5.13},{"$f":"IF(B6>=F17,VLOOKUP(B6,'FxExpress Saver'!A7:H59,B8),VLOOKUP(F17,'FxExpress Saver'!A7:H59,B8))","v":4.88},null,null,null,null,null,null,"UPS DOES NOT HAVE EARLY RESIDENTAL DELIVERLY"]
["Fedex Contract Rate","GND","NDA","ND Svr","2 DA AM","2DA ","3DS"]
["Comm",{"$f":"B25","v":3.7},{"$f":"C25","v":6.3},{"$f":"D25","v":5.96},{"$f":" E25","v":5.71},{"$f":"F25","v":5.13},{"$f":"G25","v":4.88}]
["Residental",{"$f":"B29","v":7.5500000000000007},{"$f":"C29","v":10.15},{"$f":"D29","v":9.81},{"$f":" E29","v":9.56},{"$f":"F29","v":8.98},{"$f":"G29","v":8.73}]
[null,{"$f":"IFERROR((B27+3.85),\"**\")","v":7.5500000000000007},{"$f":"SUM(C27)+ 3.85","v":10.15},{"$f":"D27 + 3.85","v":9.81},{"$f":"E27 + 3.85","v":9.56},{"$f":"SUM(F27,3.85)","v":8.98},{"$f":"IFERROR((G27+3.85),\"**\")","v":8.73}]
[]
["INTERNATIONAL SHIPPING LETTER RATE COMPARISON "]
[null,"DHL","UPS","FEDEX","FEDEX E& I"]
["UK - ENGLAND",7.82,24.34,27.22,19.3]
["SAUDI ARABIA-RIYADH",13.44,27.8,39.29,21.9]
["IRAQ - BAGDAD",12.54,51.99,60.48,17.100000000000001]
["CHINA - BEIJING",12.02,26.43,30.94,15.35]

{"sheet":"Ground Current","index":5,"n_rows":156,"n_cols":23,"rows_kept":156,"cut":false,"hidden":true,"merged":[[2,22,3,22],[2,8,3,8],[2,9,3,9],[2,10,3,10],[2,20,3,20],[2,21,3,21]]}
["UPS Ground Service",null,null,null,null,null,null,null,null,null,null,null,{"$f":"M1:X89UPS Ground Service","v":{"$error":"#NAME?"}},null,null,null,"Residential Surcharge",null,null,1.34]
["- Commercial",null,null,null,null,null,null,null,null,null,null,null,"- Residential"]
["(Per Package Rates from 48 State Origin)",null,null,null,null,null,null,null,"Metro AK & HI","PR","Remote AK",null,"(Per Package Rates from 48 State Origin)",null,null,null,null,null,null,null,"Metro AK & HI","PR","Remote AK"]
["Rates below do not include Residential Surcharge",null,null,null,null,null,null,null,null,null,null,null,"Rates Include Residential Surcharge"]
[null,2,3,4,5,6,7,8,"Zone 44","Zone 45","Zone 46",null,"Lbs.",2,3,4,5,6,7,8,"Zone 44","Zone 45","Zone 46"]
["","","","","","","","","","","",null,"","","","","","","","","","",""]
[1,3.5394000000000001,3.5394000000000001,3.5394000000000001,3.5394000000000001,3.5394000000000001,3.5802,3.6821999999999999,15.514200000000001,14.953200000000001,15.514200000000001,null,1,4.8794000000000004,4.8794000000000004,4.8794000000000004,4.8794000000000004,4.8794000000000004,4.9202000000000004,5.0221999999999998,16.854200000000002,16.293200000000002,16.854200000000002]
[2,3.5394000000000001,3.5394000000000001,3.5394000000000001,3.6516000000000002,3.8555999999999999,3.8555999999999999,3.8555999999999999,17.227800000000002,16.605600000000003,17.227800000000002,null,2,4.8794000000000004,4.8794000000000004,4.8794000000000004,4.9916,5.1955999999999998,5.1955999999999998,5.1955999999999998,18.567800000000002,17.945600000000002,18.567800000000002]
[3,3.5394000000000001,3.5394000000000001,3.8454000000000002,3.8555999999999999,3.8555999999999999,3.8963999999999999,4.2023999999999999,18.788400000000003,18.094799999999999,18.788400000000003,null,3,4.8794000000000004,4.8794000000000004,5.1854000000000005,5.1955999999999998,5.1955999999999998,5.2363999999999997,5.5423999999999998,20.128400000000003,19.434799999999999,20.128400000000003]
[4,3.5394000000000001,3.5394000000000001,3.8555999999999999,3.8555999999999999,3.9882000000000004,4.1106000000000007,4.4777999999999993,20.532599999999999,19.777799999999999,20.532599999999999,null,4,4.8794000000000004,4.8794000000000004,5.1955999999999998,5.1955999999999998,5.3282000000000007,5.4506000000000006,5.8177999999999992,21.872599999999998,21.117799999999999,21.872599999999998]
[5,3.5394000000000001,3.6617999999999999,3.8555999999999999,3.9066000000000001,4.1718000000000002,4.3248000000000006,4.7430000000000003,22.368600000000001,21.5322,22.368600000000001,null,5,4.8794000000000004,5.0018000000000002,5.1955999999999998,5.2465999999999999,5.5118,5.6648000000000005,6.0830000000000002,23.708600000000001,22.872199999999999,23.708600000000001]
[6,3.5394000000000001,3.7842000000000002,3.8555999999999999,3.9066000000000001,4.2126000000000001,4.3553999999999995,4.7633999999999999,24.286199999999997,23.398800000000001,24.286199999999997,null,6,4.8794000000000004,5.1242000000000001,5.1955999999999998,5.2465999999999999,5.5526,5.6953999999999994,6.1033999999999997,25.626199999999997,24.738800000000001,25.626199999999997]
[7,3.6720000000000002,3.8555999999999999,3.8555999999999999,4.0289999999999999,4.2942,4.5186000000000002,4.9775999999999998,25.948800000000002,24.990000000000002,25.948800000000002,null,7,5.0120000000000005,5.1955999999999998,5.1955999999999998,5.3689999999999998,5.6341999999999999,5.8586,6.3175999999999997,27.288800000000002,26.330000000000002,27.288800000000002]
[8,3.8046000000000002,3.8555999999999999,3.8555999999999999,4.1310000000000002,4.4369999999999994,4.7225999999999999,5.3040000000000003,27.499200000000002,26.479200000000002,27.499200000000002,null,8,5.1446000000000005,5.1955999999999998,5.1955999999999998,5.4710000000000001,5.7769999999999992,6.0625999999999998,6.6440000000000001,28.839200000000002,27.819200000000002,28.839200000000002]
[9,3.8555999999999999,3.8555999999999999,3.9371999999999998,4.2330000000000005,4.5491999999999999,4.9674000000000005,5.6406000000000001,29.437200000000001,28.345800000000001,29.437200000000001,null,9,5.1955999999999998,5.1955999999999998,5.2771999999999997,5.5730000000000004,5.8891999999999998,6.3074000000000003,6.9805999999999999,30.777200000000001,29.6858,30.777200000000001]
[10,3.8555999999999999,3.8555999999999999,3.9575999999999998,4.2534000000000001,4.7430000000000003,5.3448000000000002,6.0180000000000007,31.252800000000001,30.100200000000001,31.252800000000001,null,10,5.1955999999999998,5.1955999999999998,5.2976000000000001,5.5933999999999999,6.0830000000000002,6.6848000000000001,7.3580000000000005,32.592800000000004,31.440200000000001,32.592800000000004]
[11,6,6,3.8658000000000001,4.1514000000000006,4.641,5.3651999999999997,6.0792000000000002,33.027600000000007,31.813800000000001,33.027600000000007,null,11,5.0834000000000001,5.0834000000000001,5.2058,5.4914000000000005,5.9809999999999999,6.7051999999999996,7.4192,34.36760000000001,33.153800000000004,34.36760000000001]
[12,3.7433999999999998,3.7433999999999998,3.9066000000000001,4.2330000000000005,4.8653999999999993,5.7222000000000008,6.5076000000000001,34.465800000000002,33.180599999999998,34.465800000000002,null,12,5.0834000000000001,5.0834000000000001,5.2465999999999999,5.5730000000000004,6.2053999999999991,7.0622000000000007,7.8475999999999999,35.805800000000005,34.520600000000002,35.805800000000005]
[13,3.7433999999999998,3.7433999999999998,3.9779999999999998,4.3452000000000002,5.0898000000000003,6.0996000000000006,6.9564000000000004,35.863199999999999,34.547399999999996,35.863199999999999,null,13,5.0834000000000001,5.0834000000000001,5.3179999999999996,5.6852,6.4298000000000002,7.4396000000000004,8.2964000000000002,37.203200000000002,35.8874,37.203200000000002]
[14,3.7433999999999998,3.8454000000000002,4.0595999999999997,4.4472000000000005,5.3651999999999997,6.4565999999999999,7.3848000000000003,37.372799999999998,35.985600000000005,37.372799999999998,null,14,5.0834000000000001,5.1854000000000005,5.3995999999999995,5.7872000000000003,6.7051999999999996,7.7965999999999998,8.7248000000000001,38.712800000000001,37.325600000000009,38.712800000000001]
[15,3.7433999999999998,3.9575999999999998,4.1310000000000002,4.5390000000000006,5.6508000000000003,6.8136000000000001,7.8438000000000008,38.739599999999996,37.311599999999999,38.739599999999996,null,15,5.0834000000000001,5.2976000000000001,5.4710000000000001,5.8790000000000004,6.9908000000000001,8.1536000000000008,9.1838000000000015,40.079599999999999,38.651600000000002,40.079599999999999]
[16,3.8046000000000002,4.0289999999999999,4.2023999999999999,4.6206000000000005,5.8751999999999995,7.1093999999999999,8.2110000000000003,40.626599999999996,39.117000000000004,40.626599999999996,null,16,5.1446000000000005,5.3689999999999998,5.5423999999999998,5.9606000000000003,7.2151999999999994,8.4494000000000007,9.5510000000000002,41.9666,40.457000000000008,41.9666]
[17,3.8454000000000002,4.1718000000000002,4.3248000000000006,4.8246000000000002,6.1710000000000003,7.4561999999999999,8.6088000000000005,42.044400000000003,40.494000000000007,42.044400000000003,null,17,5.1854000000000005,5.5118,5.6648000000000005,6.1646000000000001,7.5110000000000001,8.7962000000000007,9.9488000000000003,43.384400000000007,41.83400000000001,43.384400000000007]
[18,3.8862000000000001,4.3146000000000004,4.4573999999999998,5.0693999999999999,6.4769999999999994,7.7927999999999997,9.0372000000000003,43.962000000000003,42.33,43.962000000000003,null,18,5.2262000000000004,5.6546000000000003,5.7973999999999997,6.4093999999999998,7.8169999999999993,9.1327999999999996,10.3772,45.302000000000007,43.67,45.302000000000007]
[19,3.9779999999999998,4.4472000000000005,4.6206000000000005,5.3040000000000003,6.7524000000000006,8.1395999999999997,9.4860000000000007,45.736800000000002,44.043599999999998,45.736800000000002,null,19,5.3179999999999996,5.7872000000000003,5.9606000000000003,6.6440000000000001,8.0924000000000014,9.4795999999999996,10.826000000000001,47.076800000000006,45.383600000000001,47.076800000000006]
[20,4.0392000000000001,4.5491999999999999,4.7633999999999999,5.61,7.1196000000000002,8.5782000000000007,10.036799999999999,47.440199999999997,45.6858,47.440199999999997,null,20,5.3792,5.8891999999999998,6.1033999999999997,6.95,8.4596,9.9182000000000006,11.376799999999999,48.780200000000001,47.025800000000004,48.780200000000001]
[21,4.0595999999999997,4.6206000000000005,4.8348000000000004,5.6508000000000003,7.1909999999999998,8.6189999999999998,10.1286,48.715199999999996,46.909800000000004,48.715199999999996,null,21,5.3995999999999995,5.9606000000000003,6.1748000000000003,6.9908000000000001,8.5310000000000006,9.9589999999999996,11.4686,50.055199999999999,48.249800000000008,50.055199999999999]
[22,4.1616,4.7736000000000001,5.0082000000000004,5.8751999999999995,7.4766000000000004,8.9555999999999987,10.577399999999999,50.214599999999997,48.368400000000001,50.214599999999997,null,22,5.5015999999999998,6.1135999999999999,6.3482000000000003,7.2151999999999994,8.8166000000000011,10.295599999999999,11.917399999999999,51.554600000000001,49.708400000000005,51.554600000000001]
[23,4.2534000000000001,4.9164000000000003,5.1714000000000002,6.0893999999999995,7.7622000000000009,9.282,10.9956,51.744599999999998,49.837200000000003,51.744599999999998,null,23,5.5933999999999999,6.2564000000000002,6.5114000000000001,7.4293999999999993,9.1022000000000016,10.622,12.335599999999999,53.084600000000002,51.177200000000006,53.084600000000002]
[24,4.3553999999999995,5.0388000000000002,5.3448000000000002,6.2730000000000006,8.0478000000000005,9.6083999999999996,11.423999999999999,53.437800000000003,51.469200000000001,53.437800000000003,null,24,5.6953999999999994,6.3788,6.6848000000000001,7.6130000000000004,9.3878000000000004,10.948399999999999,12.763999999999999,54.777800000000006,52.809200000000004,54.777800000000006]
[25,4.4573999999999998,5.1714000000000002,5.5182000000000002,6.4668000000000001,8.3333999999999993,9.934800000000001,11.872800000000002,55.100400000000008,53.070599999999999,55.100400000000008,null,25,5.7973999999999997,6.5114000000000001,6.8582000000000001,7.8068,9.6733999999999991,11.274800000000001,13.212800000000001,56.440400000000011,54.410600000000002,56.440400000000011]
[26,4.5696000000000003,5.2938000000000001,5.6711999999999998,6.681,8.6394000000000002,10.2714,12.280799999999999,56.956800000000001,54.855600000000003,56.956800000000001,null,26,5.9096000000000002,6.6337999999999999,7.0111999999999997,8.0210000000000008,9.9794,11.6114,13.620799999999999,58.296800000000005,56.195600000000006,58.296800000000005]
[27,4.6919999999999993,5.4264000000000001,5.8446000000000007,6.8952,8.9352,10.597800000000001,12.709200000000001,58.527600000000007,56.355000000000004,58.527600000000007,null,27,6.0319999999999991,6.7664,7.1846000000000005,8.2352000000000007,10.2752,11.937800000000001,14.049200000000001,59.86760000000001,57.695000000000007,59.86760000000001]
[28,4.7838000000000003,5.5488000000000008,6.0282,7.0890000000000004,9.2310000000000016,10.924200000000001,13.158000000000001,60.098400000000005,57.884999999999998,60.098400000000005,null,28,6.1238000000000001,6.8888000000000007,7.3681999999999999,8.4290000000000003,10.571000000000002,12.264200000000001,14.498000000000001,61.438400000000009,59.225000000000001,61.438400000000009]
[29,4.8857999999999997,5.6711999999999998,6.2016,7.2930000000000001,9.5267999999999997,11.2506,13.6068,61.577399999999997,59.302800000000005,61.577399999999997,null,29,6.2257999999999996,7.0111999999999997,7.5415999999999999,8.6330000000000009,10.8668,12.5906,14.9468,62.917400000000001,60.642800000000008,62.917400000000001]
[30,5.0082000000000004,5.8242000000000003,6.3852000000000002,7.5275999999999996,9.8328000000000007,11.587199999999999,14.045399999999999,63.046200000000006,60.720600000000005,63.046200000000006,null,30,6.3482000000000003,7.1642000000000001,7.7252000000000001,8.8675999999999995,11.172800000000001,12.927199999999999,15.385399999999999,64.386200000000002,62.060600000000008,64.386200000000002]
[31,5.0999999999999996,5.9364000000000008,6.5484,7.7214,10.1082,11.9238,14.443200000000001,64.596599999999995,62.22,64.596599999999995,null,31,6.4399999999999995,7.2764000000000006,7.8883999999999999,9.0614000000000008,11.4482,13.2638,15.783200000000001,65.936599999999999,63.56,65.936599999999999]
[32,5.1509999999999998,6.069,6.7319999999999993,7.9253999999999998,10.393799999999999,12.24,14.891999999999999,65.994,63.566400000000002,65.994,null,32,6.4909999999999997,7.4089999999999998,8.0719999999999992,9.2653999999999996,11.733799999999999,13.58,16.231999999999999,67.334000000000003,64.906400000000005,67.334000000000003]
[33,5.2530000000000001,6.2016,6.8952,8.16,10.669200000000002,12.576600000000001,15.3102,67.39139999999999,64.892399999999995,67.39139999999999,null,33,6.593,7.5415999999999999,8.2352000000000007,9.5,12.009200000000002,13.916600000000001,16.650200000000002,68.731399999999994,66.232399999999998,68.731399999999994]
[34,5.3550000000000004,6.3444000000000003,7.0583999999999998,8.363999999999999,10.965,12.903,15.748799999999999,68.880600000000001,66.340800000000002,68.880600000000001,null,34,6.6950000000000003,7.6844000000000001,8.3984000000000005,9.7039999999999988,12.305,14.243,17.088799999999999,70.220600000000005,67.680800000000005,70.220600000000005]
[35,5.4467999999999996,6.4872000000000005,7.242,8.5782000000000007,11.2506,13.2294,16.146599999999999,70.584000000000003,67.983000000000004,70.584000000000003,null,35,6.7867999999999995,7.8272000000000004,8.5820000000000007,9.9182000000000006,12.5906,14.5694,17.486599999999999,71.924000000000007,69.323000000000008,71.924000000000007]
[36,5.5488000000000008,6.5994000000000002,7.3950000000000005,8.7923999999999989,11.526000000000002,13.566000000000001,16.534200000000002,72.246600000000001,69.584400000000002,72.246600000000001,null,36,6.8888000000000007,7.9394,8.7350000000000012,10.132399999999999,12.866000000000001,14.906000000000001,17.874200000000002,73.586600000000004,70.924400000000006,73.586600000000004]
[37,5.6303999999999998,6.7524000000000006,7.5684000000000005,8.9964000000000013,11.781000000000001,13.882199999999999,16.860600000000002,73.899000000000001,71.165399999999991,73.899000000000001,null,37,6.9703999999999997,8.0924000000000014,8.9084000000000003,10.336400000000001,13.121,15.222199999999999,18.200600000000001,75.239000000000004,72.505399999999995,75.239000000000004]
[38,5.7222000000000008,6.8849999999999998,7.7417999999999996,9.2310000000000016,12.046200000000001,14.2188,17.166599999999999,75.663600000000002,72.868799999999993,75.663600000000002,null,38,7.0622000000000007,8.2249999999999996,9.0817999999999994,10.571000000000002,13.386200000000001,15.5588,18.506599999999999,77.003600000000006,74.208799999999997,77.003600000000006]
[39,5.8140000000000001,7.0074000000000005,7.9050000000000002,9.4248000000000012,12.311400000000001,14.545199999999999,17.492999999999999,77.305800000000005,74.439599999999999,77.305800000000005,null,39,7.1539999999999999,8.3474000000000004,9.245000000000001,10.764800000000001,13.651400000000001,15.885199999999999,18.832999999999998,78.645800000000008,75.779600000000002,78.645800000000008]
[40,5.8853999999999997,7.1706000000000003,8.0784000000000002,9.6389999999999993,12.5868,14.871600000000001,17.798999999999999,78.948000000000008,76.030800000000013,78.948000000000008,null,40,7.2253999999999996,8.5106000000000002,9.4184000000000001,10.978999999999999,13.9268,16.211600000000001,19.138999999999999,80.288000000000011,77.370800000000017,80.288000000000011]
[41,5.9976000000000003,7.2827999999999999,8.2314000000000007,9.8532000000000011,12.841799999999999,15.2082,18.125399999999999,80.467799999999997,77.499600000000001,80.467799999999997,null,41,7.3376000000000001,8.6227999999999998,9.5714000000000006,11.193200000000001,14.181799999999999,16.548200000000001,19.465399999999999,81.8078,78.839600000000004,81.8078]
[42,6.0893999999999995,7.4051999999999998,8.3946000000000005,10.0572,13.086600000000001,15.524400000000002,18.4314,81.977400000000003,78.968400000000003,81.977400000000003,null,42,7.4293999999999993,8.7452000000000005,9.7346000000000004,11.3972,14.426600000000001,16.864400000000003,19.7714,83.317400000000006,80.308400000000006,83.317400000000006]
[43,6.1608000000000001,7.5480000000000009,8.5782000000000007,10.2714,13.321200000000001,15.861000000000001,18.747599999999998,83.650200000000012,80.569800000000001,83.650200000000012,null,43,7.5007999999999999,8.8880000000000017,9.9182000000000006,11.6114,14.661200000000001,17.201000000000001,20.087599999999998,84.990200000000016,81.909800000000004,84.990200000000016]
[44,6.2322000000000006,7.6601999999999997,8.7005999999999997,10.4856,13.5762,16.177199999999999,19.063800000000001,85.323000000000008,82.171199999999999,85.323000000000008,null,44,7.5722000000000005,9.0001999999999995,10.0406,11.8256,14.9162,17.517199999999999,20.4038,86.663000000000011,83.511200000000002,86.663000000000011]
[45,6.3035999999999994,7.8030000000000008,8.8739999999999988,10.6998,13.800599999999999,16.513800000000003,19.38,86.975399999999993,83.7624,86.975399999999993,null,45,7.6435999999999993,9.1430000000000007,10.213999999999999,12.0398,15.140599999999999,17.853800000000003,20.72,88.315399999999997,85.102400000000003,88.315399999999997]
[46,6.3852000000000002,7.9253999999999998,8.9964000000000013,10.9038,14.014800000000001,16.8504,19.706400000000002,88.6584,85.384199999999993,88.6584,null,46,7.7252000000000001,9.2653999999999996,10.336400000000001,12.2438,15.354800000000001,18.1904,21.046400000000002,89.998400000000004,86.724199999999996,89.998400000000004]
[47,6.4464000000000006,8.0478000000000005,9.1494,11.087399999999999,14.2188,17.166599999999999,20.012400000000003,90.351600000000005,87.006,90.351600000000005,null,47,7.7864000000000004,9.3878000000000004,10.4894,12.427399999999999,15.5588,18.506599999999999,21.352400000000003,91.691600000000008,88.346000000000004,91.691600000000008]
[48,6.4872000000000005,8.16,9.282,11.291400000000001,14.412600000000001,17.5032,20.338800000000003,91.902000000000001,88.505399999999995,91.902000000000001,null,48,7.8272000000000004,9.5,10.622,12.631400000000001,15.752600000000001,18.8432,21.678800000000003,93.242000000000004,89.845399999999998,93.242000000000004]
[49,6.5076000000000001,8.16,9.4248000000000012,11.475,14.626799999999999,17.819399999999998,20.665200000000002,93.472800000000007,90.025200000000012,93.472800000000007,null,49,7.8475999999999999,9.5,10.764800000000001,12.815,15.966799999999999,19.159399999999998,22.005200000000002,94.81280000000001,91.365200000000016,94.81280000000001]
[50,6.5280000000000005,8.1804000000000006,9.4350000000000005,11.505599999999999,14.8002,18.156000000000002,20.9712,95.053799999999995,91.53479999999999,95.053799999999995,null,50,7.8680000000000003,9.5204000000000004,10.775,12.845599999999999,16.1402,19.496000000000002,22.311199999999999,96.393799999999999,92.874799999999993,96.393799999999999]
[51,6.5484,8.2110000000000003,9.4451999999999998,11.536200000000001,14.8818,18.217199999999998,21.032400000000003,96.655200000000008,93.0852,96.655200000000008,null,51,7.8883999999999999,9.5510000000000002,10.7852,12.876200000000001,16.221800000000002,19.557199999999998,22.372400000000003,97.995200000000011,94.425200000000004,97.995200000000011]
[52,6.5586000000000002,8.2212000000000014,9.4757999999999996,11.587199999999999,14.953200000000001,18.2682,21.134399999999999,98.215800000000002,94.584600000000009,98.215800000000002,null,52,7.8986000000000001,9.5612000000000013,10.815799999999999,12.927199999999999,16.293200000000002,19.6082,22.474399999999999,99.555800000000005,95.924600000000012,99.555800000000005]
[53,6.63,8.3130000000000006,9.5777999999999999,11.7402,14.9838,18.339600000000001,21.195600000000002,99.704999999999998,96.022800000000004,99.704999999999998,null,53,7.97,9.6530000000000005,10.9178,13.0802,16.323800000000002,19.679600000000001,22.535600000000002,101.045,97.362800000000007,101.045]
[54,6.6911999999999994,8.3844000000000012,9.7103999999999999,11.9034,14.994,18.523199999999999,21.5016,101.286,97.542599999999993,101.286,null,54,8.0312000000000001,9.724400000000001,11.0504,13.243399999999999,16.334,19.863199999999999,22.8416,102.626,98.882599999999996,102.626]
[55,6.7625999999999999,8.4455999999999989,9.8021999999999991,12.0564,15.187800000000001,18.655799999999999,21.807600000000001,102.85680000000001,99.052199999999999,102.85680000000001,null,55,8.1026000000000007,9.7855999999999987,11.142199999999999,13.3964,16.527800000000003,19.995799999999999,23.147600000000001,104.19680000000001,100.3922,104.19680000000001]
[56,6.8238000000000003,8.5373999999999999,9.9144000000000005,12.229800000000001,15.351000000000001,18.7986,22.113600000000002,104.44800000000001,100.59240000000001,104.44800000000001,null,56,8.1638000000000002,9.8773999999999997,11.2544,13.569800000000001,16.691000000000003,20.1386,23.453600000000002,105.78800000000001,101.93240000000002,105.78800000000001]
[57,6.8952,8.6189999999999998,10.016400000000001,12.4236,15.514200000000001,18.9312,22.388999999999999,106.10039999999999,102.18360000000001,106.10039999999999,null,57,8.2352000000000007,9.9589999999999996,11.356400000000001,13.7636,16.854200000000002,20.2712,23.728999999999999,107.4404,103.52360000000002,107.4404]
[58,6.9564000000000004,8.7005999999999997,10.1286,12.5562,15.697800000000001,19.043400000000002,22.613400000000002,107.6814,103.71360000000001,107.6814,null,58,8.2964000000000002,10.0406,11.4686,13.8962,17.037800000000001,20.383400000000002,23.953400000000002,109.0214,105.05360000000002,109.0214]
[59,7.0278,8.8026000000000018,10.251000000000001,12.658200000000001,15.8508,19.165800000000001,22.766400000000001,109.3338,105.2946,109.3338,null,59,8.3678000000000008,10.142600000000002,11.591000000000001,13.998200000000001,17.190799999999999,20.505800000000001,24.106400000000001,110.6738,106.63460000000001,110.6738]
[60,7.0890000000000004,8.9046000000000003,10.363200000000001,12.75,15.963000000000001,19.277999999999999,22.9194,111.04740000000001,106.93680000000001,111.04740000000001,null,60,8.4290000000000003,10.2446,11.703200000000001,14.09,17.303000000000001,20.617999999999999,24.259399999999999,112.38740000000001,108.27680000000001,112.38740000000001]
[61,7.1706000000000003,8.9760000000000009,10.4754,12.903,16.116,19.369799999999998,23.052000000000003,112.3938,108.2526,112.3938,null,61,8.5106000000000002,10.316000000000001,11.8154,14.243,17.456,20.709799999999998,24.392000000000003,113.7338,109.5926,113.7338]
[62,7.2216000000000005,9.0473999999999997,10.577399999999999,13.0152,16.238399999999999,19.482000000000003,23.205000000000002,114.2604,110.04780000000001,114.2604,null,62,8.5616000000000003,10.3874,11.917399999999999,14.3552,17.578399999999998,20.822000000000003,24.545000000000002,115.60040000000001,111.38780000000001,115.60040000000001]
[63,7.2827999999999999,9.1494,10.658999999999999,13.1172,16.340399999999999,19.6248,23.337599999999998,116.11680000000001,111.82259999999999,116.11680000000001,null,63,8.6227999999999998,10.4894,11.998999999999999,14.4572,17.680399999999999,20.9648,24.677599999999998,117.45680000000002,113.1626,117.45680000000002]
[64,7.3338000000000001,9.241200000000001,10.7814,13.219200000000001,16.4526,19.757400000000001,23.480399999999999,118.0548,113.6994,118.0548,null,64,8.6738,10.581200000000001,12.1214,14.559200000000001,17.7926,21.0974,24.820399999999999,119.3948,115.0394,119.3948]
[65,7.3950000000000005,9.3431999999999995,10.9038,13.300799999999999,16.595400000000001,19.859400000000001,23.613,119.97240000000001,115.54560000000001,119.97240000000001,null,65,8.7350000000000012,10.683199999999999,12.2438,14.640799999999999,17.935400000000001,21.199400000000001,24.952999999999999,121.31240000000001,116.88560000000001,121.31240000000001]
[66,7.4664000000000001,9.4656000000000002,11.026200000000001,13.382399999999999,16.758600000000001,19.9512,23.7864,121.839,117.3306,121.839,null,66,8.8064,10.8056,12.366200000000001,14.722399999999999,18.098600000000001,21.2912,25.1264,123.179,118.67060000000001,123.179]
[67,7.5275999999999996,9.5573999999999995,11.1486,13.4946,16.9116,20.042999999999999,23.8476,123.675,119.1156,123.675,null,67,8.8675999999999995,10.897399999999999,12.4886,14.8346,18.2516,21.382999999999999,25.1876,125.015,120.4556,125.015]
[68,7.5785999999999998,9.6492000000000004,11.22,13.5456,16.983000000000001,20.165399999999998,23.898600000000002,125.4498,120.8292,125.4498,null,68,8.9185999999999996,10.9892,12.56,14.8856,18.323,21.505399999999998,25.238600000000002,126.7898,122.1692,126.7898]
[69,7.6398000000000001,9.7410000000000014,11.240399999999999,13.566000000000001,17.0748,20.2776,23.97,127.3062,122.5938,127.3062,null,69,8.9798000000000009,11.081000000000001,12.580399999999999,14.906000000000001,18.4148,21.617599999999999,25.31,128.64619999999999,123.93380000000001,128.64619999999999]
[70,7.7009999999999996,9.843,11.2506,13.586400000000001,17.166599999999999,20.3796,24.031199999999998,129.9786,125.1846,129.9786,null,70,9.0410000000000004,11.183,12.5906,14.926400000000001,18.506599999999999,21.7196,25.371199999999998,131.3186,126.52460000000001,131.3186]
[71,7.7826000000000004,9.8634000000000004,11.2608,13.6068,17.238,20.502000000000002,24.092400000000001,131.9676,127.092,131.9676,null,71,9.1226000000000003,11.2034,12.6008,14.9468,18.577999999999999,21.842000000000002,25.432400000000001,133.30760000000001,128.43199999999999,133.30760000000001]
[72,8.16,10.1388,11.352600000000001,13.7088,17.288999999999998,20.522400000000001,24.1128,133.93620000000001,128.98919999999998,133.93620000000001,null,72,9.5,11.4788,12.692600000000001,15.0488,18.628999999999998,21.862400000000001,25.4528,135.27620000000002,130.32919999999999,135.27620000000002]
[73,8.5782000000000007,10.506,11.607600000000001,14.0556,17.350200000000001,20.573400000000003,24.133200000000002,135.8844,130.87620000000001,135.8844,null,73,9.9182000000000006,11.846,12.947600000000001,15.3956,18.690200000000001,21.913400000000003,25.473200000000002,137.2244,132.21620000000001,137.2244]
[74,8.9657999999999998,10.893599999999999,11.9748,14.422800000000001,17.676599999999997,20.726400000000002,24.153600000000001,137.19,132.1206,137.19,null,74,10.3058,12.233599999999999,13.3148,15.7628,19.016599999999997,22.066400000000002,25.493600000000001,138.53,133.4606,138.53]
[75,9.3635999999999999,11.2506,12.311400000000001,14.790000000000001,17.992800000000003,21.103800000000003,24.173999999999999,138.76079999999999,133.6404,138.76079999999999,null,75,10.7036,12.5906,13.651400000000001,16.130000000000003,19.332800000000002,22.443800000000003,25.513999999999999,140.10079999999999,134.9804,140.10079999999999]
[76,9.7715999999999994,11.607600000000001,12.6684,15.1572,18.309000000000001,21.5016,24.2148,140.46420000000001,135.2826,140.46420000000001,null,76,11.111599999999999,12.947600000000001,14.0084,16.497199999999999,19.649000000000001,22.8416,25.5548,141.80420000000001,136.62260000000001,141.80420000000001]
[77,10.179600000000001,11.984999999999999,13.0152,15.483599999999999,18.645600000000002,21.889200000000002,24.276,141.63720000000001,136.39439999999999,141.63720000000001,null,77,11.519600000000001,13.324999999999999,14.3552,16.823599999999999,19.985600000000002,23.229200000000002,25.616,142.97720000000001,137.73439999999999,142.97720000000001]
[78,10.5876,12.3522,13.351800000000001,15.830399999999999,18.9618,22.276800000000001,24.3066,142.3818,137.11860000000001,142.3818,null,78,11.9276,13.6922,14.691800000000001,17.170400000000001,20.3018,23.616800000000001,25.646599999999999,143.7218,138.45860000000002,143.7218]
[79,10.975199999999999,12.7194,13.7088,16.177199999999999,19.2882,22.593,24.398400000000002,142.40220000000002,137.13899999999998,142.40220000000002,null,79,12.315199999999999,14.0594,15.0488,17.517199999999999,20.6282,23.933,25.738400000000002,143.74220000000003,138.47899999999998,143.74220000000003]
[80,11.3832,13.0968,14.0556,16.524000000000001,19.614599999999999,22.899000000000001,24.7044,143.9016,138.5772,143.9016,null,80,12.7232,14.4368,15.3956,17.864000000000001,20.954599999999999,24.239000000000001,26.0444,145.24160000000001,139.91720000000001,145.24160000000001]
[81,11.668799999999999,13.413,14.392199999999999,16.748400000000004,19.869600000000002,23.215200000000003,25.000200000000003,145.11540000000002,139.75020000000001,145.11540000000002,null,81,13.008799999999999,14.753,15.732199999999999,18.088400000000004,21.209600000000002,24.555200000000003,26.340200000000003,146.45540000000003,141.09020000000001,146.45540000000003]
[82,12.066600000000001,13.739400000000002,14.749200000000002,17.095200000000002,20.124600000000001,23.531400000000001,25.285799999999998,145.82939999999999,140.44380000000001,145.82939999999999,null,82,13.406600000000001,15.079400000000001,16.089200000000002,18.435200000000002,21.464600000000001,24.871400000000001,26.625799999999998,147.1694,141.78380000000001,147.1694]
[83,12.4848,14.076000000000001,15.085799999999999,17.431799999999999,20.430600000000002,23.8476,25.581599999999998,147.4308,141.98399999999998,147.4308,null,83,13.8248,15.416,16.425799999999999,18.771799999999999,21.770600000000002,25.1876,26.921599999999998,148.77080000000001,143.32399999999998,148.77080000000001]
[84,12.892800000000001,14.422800000000001,15.4122,17.758200000000002,20.736599999999999,24.133200000000002,25.857000000000003,149.13420000000002,143.62620000000001,149.13420000000002,null,84,14.232800000000001,15.7628,16.752200000000002,19.098200000000002,22.076599999999999,25.473200000000002,27.197000000000003,150.47420000000002,144.96620000000001,150.47420000000002]
[85,13.300799999999999,14.7798,15.748799999999999,18.094799999999999,21.0426,24.398400000000002,26.152800000000003,150.84779999999998,145.27860000000001,150.84779999999998,null,85,14.640799999999999,16.119800000000001,17.088799999999999,19.434799999999999,22.3826,25.738400000000002,27.492800000000003,152.18779999999998,146.61860000000001,152.18779999999998]
[86,13.739400000000002,15.147,16.075199999999999,18.4314,21.348600000000001,24.673800000000004,26.438400000000001,152.43899999999999,146.80860000000001,152.43899999999999,null,86,15.079400000000001,16.487000000000002,17.415199999999999,19.7714,22.688600000000001,26.013800000000003,27.778400000000001,153.779,148.14860000000002,153.779]
[87,14.167800000000002,15.4938,16.462800000000001,18.767999999999997,21.623999999999999,24.928800000000003,26.724,154.15260000000001,148.46100000000001,154.15260000000001,null,87,15.507800000000001,16.8338,17.802800000000001,20.107999999999997,22.963999999999999,26.268800000000002,28.064,155.49260000000001,149.80100000000002,155.49260000000001]
[88,14.6166,15.8508,16.799399999999999,19.0944,21.909600000000001,25.1736,27.03,155.85600000000002,150.10319999999999,155.85600000000002,null,88,15.9566,17.190799999999999,18.139399999999998,20.4344,23.249600000000001,26.5136,28.37,157.19600000000003,151.44319999999999,157.19600000000003]
[89,15.034800000000001,16.1874,17.125799999999998,19.4208,22.184999999999999,25.448999999999998,27.325800000000001,157.4778,151.67399999999998,157.4778,null,89,16.3748,17.5274,18.465799999999998,20.7608,23.524999999999999,26.788999999999998,28.665800000000001,158.81780000000001,153.01399999999998,158.81780000000001]
[90,15.483599999999999,16.554600000000001,17.462400000000002,19.696199999999997,22.4604,25.704000000000001,27.601199999999999,159.07920000000001,153.20399999999998,159.07920000000001,null,90,16.823599999999999,17.894600000000001,18.802400000000002,21.036199999999997,23.8004,27.044,28.941199999999998,160.41920000000002,154.54399999999998,160.41920000000002]
[91,15.8712,16.921800000000001,17.850000000000001,20.022600000000001,22.746000000000002,25.959,27.9072,160.7826,154.85640000000001,160.7826,null,91,17.211200000000002,18.261800000000001,19.190000000000001,21.3626,24.086000000000002,27.298999999999999,29.247199999999999,162.12260000000001,156.19640000000001,162.12260000000001]
[92,16.2486,17.258400000000002,18.176400000000001,20.3184,23.0214,26.234400000000001,28.192800000000002,162.30240000000001,156.315,162.30240000000001,null,92,17.5886,18.598400000000002,19.516400000000001,21.6584,24.3614,27.574400000000001,29.532800000000002,163.64240000000001,157.655,163.64240000000001]
[93,16.626000000000001,17.615400000000001,18.574200000000001,20.6448,23.296800000000001,26.499600000000001,28.488600000000002,163.90379999999999,157.845,163.90379999999999,null,93,17.966000000000001,18.955400000000001,19.914200000000001,21.9848,24.636800000000001,27.839600000000001,29.828600000000002,165.24379999999999,159.185,165.24379999999999]
[94,17.023800000000001,17.982599999999998,18.8904,20.91,23.5824,26.795400000000001,28.7742,165.44399999999999,159.34440000000001,165.44399999999999,null,94,18.363800000000001,19.322599999999998,20.230399999999999,22.25,24.9224,28.135400000000001,30.1142,166.78399999999999,160.68440000000001,166.78399999999999]
[95,17.421599999999998,18.319200000000002,19.2882,21.226199999999999,23.8476,27.081,29.080200000000001,167.0352,160.87440000000001,167.0352,null,95,18.761599999999998,19.659200000000002,20.6282,22.566199999999998,25.1876,28.420999999999999,30.420200000000001,168.37520000000001,162.21440000000001,168.37520000000001]
[96,17.809200000000001,18.666,19.675799999999999,21.552599999999998,24.133200000000002,27.356400000000001,29.376000000000001,168.5754,162.3432,168.5754,null,96,19.1492,20.006,21.015799999999999,22.892599999999998,25.473200000000002,28.696400000000001,30.716000000000001,169.91540000000001,163.6832,169.91540000000001]
[97,18.217199999999998,19.023,19.992000000000001,21.889200000000002,24.4086,27.631800000000002,29.682000000000002,170.19720000000001,163.89360000000002,170.19720000000001,null,97,19.557199999999998,20.363,21.332000000000001,23.229200000000002,25.7486,28.971800000000002,31.022000000000002,171.53720000000001,165.23360000000002,171.53720000000001]
[98,18.635400000000001,19.329000000000001,20.3796,22.154399999999999,24.7044,27.917400000000001,29.977800000000002,171.69660000000002,165.36240000000001,171.69660000000002,null,98,19.9754,20.669,21.7196,23.494399999999999,26.0444,29.257400000000001,31.317800000000002,173.03660000000002,166.70240000000001,173.03660000000002]
[99,19.033200000000001,19.645200000000003,20.767199999999999,22.4298,24.979799999999997,28.182600000000001,30.263400000000001,173.3082,166.91279999999998,173.3082,null,99,20.373200000000001,20.985200000000003,22.107199999999999,23.7698,26.319799999999997,29.522600000000001,31.603400000000001,174.6482,168.25279999999998,174.6482]
[100,19.441199999999998,19.961400000000001,21.144600000000001,22.766400000000001,25.255200000000002,28.4682,30.569399999999998,174.91980000000001,168.453,174.91980000000001,null,100,20.781199999999998,21.301400000000001,22.4846,24.106400000000001,26.595200000000002,29.808199999999999,31.909399999999998,176.25980000000001,169.79300000000001,176.25980000000001]
[101,22.868400000000001,23.490600000000001,25.122599999999998,26.927999999999997,29.488199999999999,33.201000000000001,35.618400000000001,176.52119999999999,170.0034,176.52119999999999,null,101,24.208400000000001,24.8306,26.462599999999998,28.267999999999997,30.828199999999999,34.541000000000004,36.958400000000005,177.8612,171.3434,177.8612]
[102,23.0928,23.857800000000001,25.418400000000002,27.295200000000001,29.7942,33.5274,35.965199999999996,178.143,171.56399999999999,178.143,null,102,24.4328,25.197800000000001,26.758400000000002,28.635200000000001,31.1342,34.867400000000004,37.305199999999999,179.483,172.904,179.483]
[103,23.490600000000001,24.225000000000001,25.7346,27.5808,30.110399999999998,33.8538,36.291599999999995,179.75459999999998,173.11439999999999,179.75459999999998,null,103,24.8306,25.565000000000001,27.0746,28.9208,31.450399999999998,35.193800000000003,37.631599999999999,181.09459999999999,174.45439999999999,181.09459999999999]
[104,23.857800000000001,24.602400000000003,26.050799999999999,27.8766,30.406199999999998,34.17,36.6282,181.458,174.75660000000002,181.458,null,104,25.197800000000001,25.942400000000003,27.390799999999999,29.2166,31.746199999999998,35.510000000000005,37.968200000000003,182.798,176.09660000000002,182.798]
[105,24.265799999999999,24.979799999999997,26.367000000000001,28.172400000000003,30.732599999999998,34.506599999999999,36.944400000000002,183.06959999999998,176.30699999999999,183.06959999999998,null,105,25.605799999999999,26.319799999999997,27.707000000000001,29.512400000000003,32.072600000000001,35.846600000000002,38.284400000000005,184.40959999999998,177.64699999999999,184.40959999999998]
[106,24.663599999999999,25.357199999999999,26.6934,28.4682,31.028400000000001,34.812600000000003,37.280999999999999,184.7526,177.93899999999999,184.7526,null,106,26.003599999999999,26.697199999999999,28.0334,29.808199999999999,32.368400000000001,36.152600000000007,38.621000000000002,186.0926,179.279,186.0926]
[107,25.061399999999999,25.744799999999998,26.999399999999998,28.763999999999999,31.354799999999997,35.139000000000003,37.617600000000003,186.46620000000001,179.5812,186.46620000000001,null,107,26.401399999999999,27.084799999999998,28.339399999999998,30.103999999999999,32.694800000000001,36.479000000000006,38.957600000000006,187.80620000000002,180.9212,187.80620000000002]
[108,25.4694,26.132400000000001,27.325800000000001,29.07,31.671000000000003,35.455199999999998,37.9542,188.15940000000001,181.2234,188.15940000000001,null,108,26.8094,27.4724,28.665800000000001,30.41,33.011000000000003,36.795200000000001,39.294200000000004,189.49940000000001,182.5634,189.49940000000001]
[109,25.857000000000003,26.499600000000001,27.621599999999997,29.376000000000001,31.956599999999998,35.791800000000002,38.290799999999997,189.78120000000001,182.7636,189.78120000000001,null,109,27.197000000000003,27.839600000000001,28.961599999999997,30.716000000000001,33.296599999999998,37.131800000000005,39.630800000000001,191.12120000000002,184.1036,191.12120000000002]
[110,26.2956,26.897400000000001,27.958200000000001,29.671800000000001,32.293199999999999,36.118199999999995,38.627400000000002,191.3826,184.31399999999999,191.3826,null,110,27.6356,28.237400000000001,29.298200000000001,31.011800000000001,33.633200000000002,37.458199999999998,39.967400000000005,192.7226,185.654,192.7226]
[111,26.581199999999999,27.203400000000002,28.284600000000001,29.977800000000002,32.588999999999999,36.434399999999997,38.943600000000004,193.55519999999999,186.405,193.55519999999999,null,111,27.921199999999999,28.543400000000002,29.624600000000001,31.317800000000002,33.929000000000002,37.7744,40.283600000000007,194.89519999999999,187.745,194.89519999999999]
[112,26.8566,27.509399999999999,28.6008,30.273600000000002,32.905200000000001,36.760800000000003,39.270000000000003,195.7482,188.5164,195.7482,null,112,28.1966,28.849399999999999,29.940799999999999,31.613600000000002,34.245200000000004,38.100800000000007,40.610000000000007,197.0882,189.85640000000001,197.0882]
[113,27.142199999999999,27.825600000000001,28.9374,30.579599999999999,33.201000000000001,37.066800000000001,39.586200000000005,197.45160000000001,190.15860000000001,197.45160000000001,null,113,28.482199999999999,29.165600000000001,30.2774,31.919599999999999,34.541000000000004,38.406800000000004,40.926200000000009,198.79160000000002,191.49860000000001,198.79160000000002]
[114,27.427800000000001,28.131599999999999,29.243400000000001,30.875399999999999,33.5274,37.3932,39.922800000000002,199.1652,191.81100000000001,199.1652,null,114,28.767800000000001,29.471599999999999,30.583400000000001,32.215400000000002,34.867400000000004,38.733200000000004,41.262800000000006,200.5052,193.15100000000001,200.5052]
[115,27.723600000000001,28.4682,29.580000000000002,31.1814,33.833400000000005,37.7196,40.249200000000002,200.85839999999999,193.44300000000001,200.85839999999999,null,115,29.063600000000001,29.808199999999999,30.92,32.5214,35.173400000000008,39.059600000000003,41.589200000000005,202.19839999999999,194.78300000000002,202.19839999999999]
[116,28.019400000000001,28.763999999999999,29.8962,31.4772,34.1496,38.035800000000002,40.575600000000001,202.50059999999999,195.0138,202.50059999999999,null,116,29.359400000000001,30.103999999999999,31.2362,32.8172,35.489600000000003,39.375800000000005,41.915600000000005,203.84059999999999,196.35380000000001,203.84059999999999]
[117,28.305,29.090399999999999,30.2226,31.783200000000001,34.455600000000004,38.362200000000001,40.902000000000001,204.11220000000003,196.5642,204.11220000000003,null,117,29.645,30.430399999999999,31.5626,33.123200000000004,35.795600000000007,39.702200000000005,42.242000000000004,205.45220000000003,197.9042,205.45220000000003]
[118,28.6008,29.406599999999997,30.569399999999998,32.089199999999998,34.771800000000006,38.678400000000003,41.218199999999996,205.73399999999998,198.12480000000002,205.73399999999998,null,118,29.940799999999999,30.746599999999997,31.909399999999998,33.429200000000002,36.111800000000009,40.018400000000007,42.558199999999999,207.07399999999998,199.46480000000003,207.07399999999998]
[119,28.896599999999999,29.743200000000002,30.8856,32.395200000000003,35.098199999999999,39.004800000000003,41.5548,208.7124,201.00120000000001,208.7124,null,119,30.236599999999999,31.083200000000001,32.2256,33.735200000000006,36.438200000000002,40.344800000000006,42.894800000000004,210.05240000000001,202.34120000000001,210.05240000000001]
[120,29.3964,30.069600000000001,31.222200000000001,32.690999999999995,35.394000000000005,39.3108,41.8812,210.42600000000002,202.65360000000001,210.42600000000002,null,120,30.7364,31.409600000000001,32.562200000000004,34.030999999999999,36.734000000000009,40.650800000000004,43.221200000000003,211.76600000000002,203.99360000000001,211.76600000000002]
[121,29.7636,30.3858,31.538400000000003,33.007199999999997,35.730600000000003,39.647399999999998,42.207600000000006,212.24160000000001,204.39779999999999,212.24160000000001,null,121,31.1036,31.7258,32.878400000000006,34.347200000000001,37.070600000000006,40.987400000000001,43.54760000000001,213.58160000000001,205.73779999999999,213.58160000000001]
[122,30.079799999999999,30.712199999999999,31.885200000000001,33.313199999999995,36.0366,39.9636,42.544200000000004,214.02660000000003,206.1318,214.02660000000003,null,122,31.419799999999999,32.052199999999999,33.225200000000001,34.653199999999998,37.376600000000003,41.303600000000003,43.884200000000007,215.36660000000003,207.4718,215.36660000000003]
[123,30.375600000000002,31.0182,32.231999999999999,33.609000000000002,36.352800000000002,40.279800000000002,42.870600000000003,215.86259999999999,207.8862,215.86259999999999,null,123,31.715600000000002,32.358200000000004,33.572000000000003,34.949000000000005,37.692800000000005,41.619800000000005,44.210600000000007,217.20259999999999,209.22620000000001,217.20259999999999]
[124,30.6816,31.365000000000002,32.558399999999999,33.935400000000001,36.669000000000004,40.606200000000001,43.217399999999998,217.65779999999998,209.62019999999998,217.65779999999998,null,124,32.021599999999999,32.705000000000005,33.898400000000002,35.275400000000005,38.009000000000007,41.946200000000005,44.557400000000001,218.99779999999998,210.96019999999999,218.99779999999998]
[125,30.967199999999998,31.691400000000002,32.905200000000001,34.220999999999997,36.975000000000001,40.912199999999999,43.5336,219.4734,211.36439999999999,219.4734,null,125,32.307200000000002,33.031400000000005,34.245200000000004,35.561,38.315000000000005,42.252200000000002,44.873600000000003,220.8134,212.70439999999999,220.8134]
[126,31.283400000000004,32.007599999999996,33.2316,34.547399999999996,37.301400000000001,41.238599999999998,43.880400000000002,221.25839999999999,213.0984,221.25839999999999,null,126,32.623400000000004,33.3476,34.571600000000004,35.8874,38.641400000000004,42.578600000000002,45.220400000000005,222.5984,214.4384,222.5984]
[127,31.568999999999999,32.344200000000001,33.578400000000002,34.843199999999996,37.607399999999998,41.564999999999998,44.206800000000001,223.08420000000001,214.8426,223.08420000000001,null,127,32.908999999999999,33.684200000000004,34.918400000000005,36.183199999999999,38.947400000000002,42.905000000000001,45.546800000000005,224.42420000000001,216.18260000000001,224.42420000000001]
[128,31.885200000000001,32.6706,33.935400000000001,35.159399999999998,37.933799999999998,41.870999999999995,44.543400000000005,224.8896,216.58680000000001,224.8896,null,128,33.225200000000001,34.010600000000004,35.275400000000005,36.499400000000001,39.273800000000001,43.210999999999999,45.883400000000009,226.2296,217.92680000000001,226.2296]
[129,32.181000000000004,33.007199999999997,34.261800000000001,35.4756,38.25,42.197399999999995,44.88,226.69499999999999,218.32079999999999,226.69499999999999,null,129,33.521000000000008,34.347200000000001,35.601800000000004,36.815600000000003,39.590000000000003,43.537399999999998,46.220000000000006,228.035,219.66079999999999,228.035]
[130,32.487000000000002,33.333599999999997,34.598400000000005,35.781599999999997,38.555999999999997,42.523800000000001,45.206400000000002,228.51060000000001,220.065,228.51060000000001,null,130,33.827000000000005,34.6736,35.938400000000009,37.121600000000001,39.896000000000001,43.863800000000005,46.546400000000006,229.85060000000001,221.405,229.85060000000001]
[131,32.813400000000001,33.680400000000006,34.955400000000004,36.097799999999999,38.882399999999997,42.850200000000001,45.542999999999999,231.42779999999999,222.87,231.42779999999999,null,131,34.153400000000005,35.020400000000009,36.295400000000008,37.437800000000003,40.2224,44.190200000000004,46.883000000000003,232.76779999999999,224.21,232.76779999999999]
[132,33.099000000000004,34.017000000000003,35.302199999999999,36.403799999999997,39.198599999999999,43.176600000000001,45.869399999999999,233.23320000000001,224.61420000000001,233.23320000000001,null,132,34.439000000000007,35.357000000000006,36.642200000000003,37.7438,40.538600000000002,44.516600000000004,47.209400000000002,234.57320000000001,225.95420000000001,234.57320000000001]
[133,33.435600000000001,34.343400000000003,35.659199999999998,36.709800000000001,39.514800000000001,43.482600000000005,46.205999999999996,235.0488,226.37880000000001,235.0488,null,133,34.775600000000004,35.683400000000006,36.999200000000002,38.049800000000005,40.854800000000004,44.822600000000008,47.545999999999999,236.3888,227.71880000000002,236.3888]
[134,33.721200000000003,34.690199999999997,35.995800000000003,37.036200000000001,39.830999999999996,43.809000000000005,46.5426,236.87459999999999,228.12300000000002,236.87459999999999,null,134,35.061200000000007,36.030200000000001,37.335800000000006,38.376200000000004,41.170999999999999,45.149000000000008,47.882600000000004,238.21459999999999,229.46300000000002,238.21459999999999]
[135,34.047600000000003,35.036999999999999,36.352800000000002,37.352399999999996,40.157399999999996,44.115000000000002,46.869000000000007,238.6902,229.86720000000003,238.6902,null,135,35.387600000000006,36.377000000000002,37.692800000000005,38.692399999999999,41.497399999999999,45.455000000000005,48.20900000000001,240.03020000000001,231.20720000000003,240.03020000000001]
[136,34.343400000000003,35.363400000000006,36.709800000000001,37.648199999999996,40.483799999999995,44.441400000000002,47.215800000000002,240.4956,231.6114,240.4956,null,136,35.683400000000006,36.703400000000009,38.049800000000005,38.988199999999999,41.823799999999999,45.781400000000005,48.555800000000005,241.8356,232.95140000000001,241.8356]
[137,34.659599999999998,35.720400000000005,37.056599999999996,37.964399999999998,40.799999999999997,44.747399999999999,47.542200000000001,242.33160000000001,233.376,242.33160000000001,null,137,35.999600000000001,37.060400000000008,38.396599999999999,39.304400000000001,42.14,46.087400000000002,48.882200000000005,243.67160000000001,234.71600000000001,243.67160000000001]
[138,34.965600000000002,36.057000000000002,37.413600000000002,38.290799999999997,41.126400000000004,45.073799999999999,47.878799999999998,244.14720000000003,235.14060000000001,244.14720000000003,null,138,36.305600000000005,37.397000000000006,38.753600000000006,39.630800000000001,42.466400000000007,46.413800000000002,49.218800000000002,245.48720000000003,236.48060000000001,245.48720000000003]
[139,35.281800000000004,36.403799999999997,37.760400000000004,38.606999999999999,41.442600000000006,45.400199999999998,48.215400000000002,245.95259999999999,236.88480000000001,245.95259999999999,null,139,36.621800000000007,37.7438,39.100400000000008,39.947000000000003,42.782600000000009,46.740200000000002,49.555400000000006,247.29259999999999,238.22480000000002,247.29259999999999]
[140,35.597999999999999,36.760800000000003,38.117399999999996,38.912999999999997,41.758800000000001,45.7164,48.552,247.6662,238.52699999999999,247.6662,null,140,36.938000000000002,38.100800000000007,39.4574,40.253,43.098800000000004,47.056400000000004,49.892000000000003,249.00620000000001,239.86699999999999,249.00620000000001]
[141,35.904000000000003,37.087200000000003,38.474400000000003,39.229199999999999,42.0852,46.032600000000002,48.888600000000004,249.40019999999998,240.18959999999998,249.40019999999998,null,141,37.244000000000007,38.427200000000006,39.814400000000006,40.569200000000002,43.425200000000004,47.372600000000006,50.228600000000007,250.74019999999999,241.52959999999999,250.74019999999999]
[142,36.230400000000003,37.4544,38.831400000000002,39.545400000000001,42.391200000000005,46.3386,49.204800000000006,251.15459999999999,241.8828,251.15459999999999,null,142,37.570400000000006,38.794400000000003,40.171400000000006,40.885400000000004,43.731200000000008,47.678600000000003,50.544800000000009,252.49459999999999,243.22280000000001,252.49459999999999]
[143,36.546599999999998,37.790999999999997,39.188400000000001,39.871800000000007,42.727800000000002,46.675199999999997,49.551600000000001,252.858,243.52500000000001,252.858,null,143,37.886600000000001,39.131,40.528400000000005,41.211800000000011,44.067800000000005,48.0152,50.891600000000004,254.19800000000001,244.86500000000001,254.19800000000001]
[144,36.872999999999998,38.137799999999999,39.545400000000001,40.1676,43.033799999999999,46.981200000000001,49.878,254.60220000000001,245.1978,254.60220000000001,null,144,38.213000000000001,39.477800000000002,40.885400000000004,41.507600000000004,44.373800000000003,48.321200000000005,51.218000000000004,255.94220000000001,246.5378,255.94220000000001]
[145,37.179000000000002,38.494800000000005,39.922800000000002,40.504200000000004,43.370400000000004,47.297399999999996,50.2044,256.38720000000001,246.92160000000001,256.38720000000001,null,145,38.519000000000005,39.834800000000008,41.262800000000006,41.844200000000008,44.710400000000007,48.6374,51.544400000000003,257.72719999999998,248.26160000000002,257.72719999999998]
[146,37.505400000000002,38.8416,40.279800000000002,40.830600000000004,43.686599999999999,47.623799999999996,50.540999999999997,258.22320000000002,248.68620000000001,258.22320000000002,null,146,38.845400000000005,40.181600000000003,41.619800000000005,42.170600000000007,45.026600000000002,48.963799999999999,51.881,259.56319999999999,250.02620000000002,259.56319999999999]
[147,37.821599999999997,39.198599999999999,40.647000000000006,41.146800000000006,44.012999999999998,47.9298,50.887799999999999,260.03879999999998,250.43040000000002,260.03879999999998,null,147,39.1616,40.538600000000002,41.987000000000009,42.486800000000009,45.353000000000002,49.269800000000004,52.227800000000002,261.37879999999996,251.77040000000002,261.37879999999996]
[148,38.137799999999999,39.545400000000001,41.014200000000002,41.463000000000001,44.339399999999998,48.266400000000004,51.214200000000005,261.85440000000006,252.18480000000002,261.85440000000006,null,148,39.477800000000002,40.885400000000004,42.354200000000006,42.803000000000004,45.679400000000001,49.606400000000008,52.554200000000009,263.19440000000003,253.52480000000003,263.19440000000003]
[149,38.464199999999998,39.9024,41.381399999999999,41.779200000000003,44.645400000000002,48.562199999999997,51.540600000000005,264.94499999999999,255.15300000000002,264.94499999999999,null,149,39.804200000000002,41.242400000000004,42.721400000000003,43.119200000000006,45.985400000000006,49.902200000000001,52.880600000000008,266.28499999999997,256.49299999999999,266.28499999999997]
[150,38.800800000000002,40.269599999999997,41.748600000000003,42.1158,44.981999999999999,48.898800000000001,51.877200000000002,266.76059999999995,256.9074,266.76059999999995,null,150,40.140800000000006,41.6096,43.088600000000007,43.455800000000004,46.322000000000003,50.238800000000005,53.217200000000005,268.10059999999993,258.24739999999997,268.10059999999993]

{"sheet":"NDA Multi","index":6,"n_rows":156,"n_cols":23,"rows_kept":156,"cut":false,"hidden":true,"merged":[[0,8,0,9],[0,16,0,18],[0,20,0,21]]}
["UPS Next Day Air Service",null,null,null,null,null,null,null,null,null,null,null,"UPS Next Day Air Service",null,null,null,"Residential Surcharge",null,null,1.59]
["- Commercial",null,null,null,null,null,null,null,null,null,null,null,"-Residential"]
["(Per Package Rates from 48 State Origin)",null,null,null,null,null,null,null,null,null,null,null,"(Per Package Rates from 48 State Origin)"]
["Rates below do not include Residential Surcharge",null,null,null,null,null,null,null,null,null,null,null,"Rates Include Residential Surcharge"]
["Lbs.",2,3,4,5,6,7,8,"Zone 124","Zone 125","Zone 126",null,"Lbs.",2,3,4,5,6,7,8,"Zone 124","Zone 125","Zone 126"]
[0.5,5.8242000000000003,5.8242000000000003,6.7014000000000005,7.2114000000000003,7.2725999999999997,8.0069999999999997,8.1395999999999997,8.67,8.67,9.1085999999999991,null,0.5,7.4142000000000001,7.4142000000000001,8.2914000000000012,8.801400000000001,8.8626000000000005,9.5969999999999995,9.7295999999999996,10.26,10.26,10.698599999999999]
[1,5.8343999999999996,7.8234000000000004,9.9960000000000004,11.0976,12.046200000000001,12.872399999999999,13.2294,13.616999999999999,13.616999999999999,13.6374,null,1,7.4243999999999994,9.4134000000000011,11.586,12.6876,13.636200000000001,14.462399999999999,14.8194,15.206999999999999,15.206999999999999,15.227399999999999]
[2,5.9567999999999994,8.4455999999999989,11.2608,12.280799999999999,13.616999999999999,14.1882,14.769600000000001,14.871600000000001,14.871600000000001,14.8818,null,2,7.5467999999999993,10.035599999999999,12.8508,13.870799999999999,15.206999999999999,15.7782,16.3596,16.461600000000001,16.461600000000001,16.471800000000002]
[3,6.7014000000000005,9.0473999999999997,12.474600000000001,13.6068,15.085799999999999,15.595799999999999,16.146599999999999,16.595399999999998,16.595399999999998,18.625200000000003,null,3,8.2914000000000012,10.6374,14.0646,15.1968,16.675799999999999,17.1858,17.736599999999999,18.185399999999998,18.185399999999998,20.215200000000003]
[4,7.2317999999999998,9.4860000000000007,13.5252,14.8818,16.472999999999999,16.982999999999997,17.646000000000001,18.125399999999999,18.125399999999999,20.308199999999999,null,4,8.8217999999999996,11.076000000000001,15.1152,16.471800000000002,18.062999999999999,18.572999999999997,19.236000000000001,19.715399999999999,19.715399999999999,21.898199999999999]
[5,7.3032000000000004,9.883799999999999,14.7798,16.289400000000001,17.860200000000003,18.390600000000003,19.053599999999999,19.614599999999999,19.614599999999999,21.8688,null,5,8.8932000000000002,11.473799999999999,16.369800000000001,17.8794,19.450200000000002,19.980600000000003,20.643599999999999,21.204599999999999,21.204599999999999,23.4588]
[6,8.0885999999999996,10.4346,15.993599999999999,17.544,19.349399999999999,19.686,20.522400000000001,21.012,21.012,23.541599999999999,null,6,9.6785999999999994,12.0246,17.583600000000001,19.134,20.939399999999999,21.276,22.112400000000001,22.602,22.602,25.131599999999999]
[7,8.4660000000000011,10.954800000000001,17.095200000000002,18.849599999999999,20.726400000000002,21.2058,21.93,22.409399999999998,22.409399999999998,25.2042,null,7,10.056000000000001,12.5448,18.685200000000002,20.439599999999999,22.316400000000002,22.7958,23.52,23.999399999999998,23.999399999999998,26.7942]
[8,8.547600000000001,11.4954,18.1968,20.063400000000001,22.103400000000001,22.684799999999999,23.337599999999998,23.776199999999999,23.776199999999999,26.448599999999999,null,8,10.137600000000001,13.0854,19.786799999999999,21.653400000000001,23.6934,24.274799999999999,24.927599999999998,25.366199999999999,25.366199999999999,28.038599999999999]
[9,8.6496000000000013,11.9238,19.237199999999998,21.358800000000002,23.490600000000001,24.163800000000002,24.837,25.285799999999998,25.285799999999998,28.182600000000001,null,9,10.239600000000001,13.5138,20.827199999999998,22.948800000000002,25.0806,25.753800000000002,26.427,26.875799999999998,26.875799999999998,29.772600000000001]
[10,8.6598000000000006,11.933999999999999,20.124600000000001,22.480799999999999,23.500799999999998,24.184200000000001,25.489799999999999,26.774999999999999,26.774999999999999,28.192800000000002,null,10,10.2498,13.523999999999999,21.714600000000001,24.070799999999998,25.090799999999998,25.7742,27.079799999999999,28.364999999999998,28.364999999999998,29.782800000000002]
[11,9.5573999999999995,13.086600000000001,21.185400000000001,23.6844,26.254799999999999,27.091199999999997,27.723600000000001,28.264200000000002,28.264200000000002,31.171199999999999,null,11,11.147399999999999,14.676600000000001,22.775400000000001,25.2744,27.844799999999999,28.681199999999997,29.313600000000001,29.854200000000002,29.854200000000002,32.761200000000002]
[12,9.9551999999999996,13.616999999999999,22.3278,24.796199999999999,27.54,28.56,29.212800000000001,29.651399999999999,29.651399999999999,31.895399999999999,null,12,11.545199999999999,15.206999999999999,23.9178,26.386199999999999,29.13,30.15,30.802800000000001,31.241399999999999,31.241399999999999,33.485399999999998]
[13,10.098000000000001,14.126999999999999,23.3886,25.928400000000003,28.651800000000001,30.079799999999999,30.630600000000001,31.140600000000003,31.140600000000003,32.813400000000001,null,13,11.688000000000001,15.716999999999999,24.9786,27.518400000000003,30.241800000000001,31.669799999999999,32.220600000000005,32.730600000000003,32.730600000000003,34.403400000000005]
[14,10.506,14.6676,24.592199999999998,27.0198,29.7636,31.385400000000001,32.119799999999998,32.527799999999999,32.527799999999999,33.741599999999998,null,14,12.096,16.2576,26.182199999999998,28.6098,31.3536,32.9754,33.709800000000001,34.117800000000003,34.117800000000003,35.331600000000002]
[15,10.628399999999999,15.055199999999999,25.418400000000002,28.1112,29.783999999999999,32.4054,33.354000000000006,33.5274,33.5274,34.598400000000005,null,15,12.218399999999999,16.645199999999999,27.008400000000002,29.7012,31.373999999999999,33.995400000000004,34.94400000000001,35.117400000000004,35.117400000000004,36.188400000000009]
[16,11.056799999999999,15.7182,26.632200000000001,29.161799999999999,31.875,33.241800000000005,34.180199999999999,34.853400000000001,34.853400000000001,36.148799999999994,null,16,12.646799999999999,17.308199999999999,28.222200000000001,30.751799999999999,33.465000000000003,34.831800000000008,35.770200000000003,36.443400000000004,36.443400000000004,37.738799999999998]
[17,11.505599999999999,16.238399999999999,27.397199999999998,30.079799999999999,32.599200000000003,33.986400000000003,34.935000000000002,35.638799999999996,35.638799999999996,37.179000000000002,null,17,13.095599999999999,17.828399999999998,28.987199999999998,31.669799999999999,34.189200000000007,35.576400000000007,36.525000000000006,37.2288,37.2288,38.769000000000005]
[18,11.9034,16.758600000000001,28.223400000000002,30.712199999999999,33.333599999999997,34.741199999999999,35.853000000000002,36.515999999999998,36.515999999999998,38.688600000000001,null,18,13.493399999999999,18.348600000000001,29.813400000000001,32.302199999999999,34.9236,36.331200000000003,37.443000000000005,38.106000000000002,38.106000000000002,40.278600000000004]
[19,12.138,17.2074,28.886400000000002,31.364999999999998,34.0884,35.516399999999997,36.801600000000001,37.729800000000004,37.729800000000004,39.729000000000006,null,19,13.728,18.7974,30.476400000000002,32.954999999999998,35.678400000000003,37.106400000000001,38.391600000000004,39.319800000000008,39.319800000000008,41.31900000000001]
[20,12.148200000000001,17.431799999999999,29.620799999999999,32.119799999999998,34.832999999999998,36.342600000000004,37.637999999999998,38.474399999999996,38.474399999999996,42.370800000000003,null,20,13.738200000000001,19.021799999999999,31.210799999999999,33.709800000000001,36.423000000000002,37.932600000000008,39.228000000000002,40.064399999999999,40.064399999999999,43.960800000000006]
[21,12.790799999999999,18.115200000000002,30.263400000000001,32.945999999999998,35.547000000000004,37.066800000000001,38.668199999999999,39.361800000000002,39.361800000000002,43.543799999999997,null,21,14.380799999999999,19.705200000000001,31.853400000000001,34.536000000000001,37.137000000000008,38.656800000000004,40.258200000000002,40.951800000000006,40.951800000000006,45.133800000000001]
[22,13.168200000000001,18.523199999999999,30.9876,33.680400000000006,36.291599999999995,37.933799999999998,39.504599999999996,40.2288,40.2288,44.553600000000003,null,22,14.7582,20.113199999999999,32.577600000000004,35.270400000000009,37.881599999999999,39.523800000000001,41.0946,41.818800000000003,41.818800000000003,46.143600000000006]
[23,13.4232,18.900600000000001,31.732199999999999,34.516800000000003,37.138199999999998,38.739599999999996,40.442999999999998,41.3202,41.3202,45.277799999999999,null,23,15.013199999999999,20.490600000000001,33.322200000000002,36.106800000000007,38.728200000000001,40.329599999999999,42.033000000000001,42.910200000000003,42.910200000000003,46.867800000000003]
[24,13.718999999999999,19.237199999999998,32.578800000000001,35.383800000000001,38.117399999999996,39.586200000000005,41.259,42.1158,42.1158,46.165199999999999,null,24,15.308999999999999,20.827199999999998,34.168800000000005,36.973800000000004,39.7074,41.176200000000009,42.849000000000004,43.705800000000004,43.705800000000004,47.755200000000002]
[25,13.831200000000001,19.339200000000002,33.405000000000001,36.118199999999995,38.5152,40.555199999999999,42.1158,43.421399999999998,43.421399999999998,46.440600000000003,null,25,15.421200000000001,20.929200000000002,34.995000000000005,37.708199999999998,40.105200000000004,42.145200000000003,43.705800000000004,45.011400000000002,45.011400000000002,48.030600000000007]
[26,14.3718,20.0838,34.323,36.995400000000004,40.1676,41.5854,42.992999999999995,44.084400000000002,44.084400000000002,47.9298,null,26,15.9618,21.6738,35.913000000000004,38.585400000000007,41.757600000000004,43.175400000000003,44.582999999999998,45.674400000000006,45.674400000000006,49.519800000000004]
[27,14.637,20.451000000000001,35.169599999999996,38.056200000000004,41.279399999999995,42.482999999999997,43.809000000000005,45.002399999999994,45.002399999999994,48.745800000000003,null,27,16.227,22.041,36.759599999999999,39.646200000000007,42.869399999999999,44.073,45.399000000000008,46.592399999999998,46.592399999999998,50.335800000000006]
[28,15.0144,20.91,36.097799999999999,39.147600000000004,42.125999999999998,43.329599999999999,44.737200000000001,45.828600000000002,45.828600000000002,49.775999999999996,null,28,16.604400000000002,22.5,37.687800000000003,40.737600000000008,43.716000000000001,44.919600000000003,46.327200000000005,47.418600000000005,47.418600000000005,51.366]
[29,15.167399999999999,21.256799999999998,37.015799999999999,39.984000000000002,43.023600000000002,44.278199999999998,45.6858,46.5732,46.5732,50.918399999999998,null,29,16.757400000000001,22.846799999999998,38.605800000000002,41.574000000000005,44.613600000000005,45.868200000000002,47.275800000000004,48.163200000000003,48.163200000000003,52.508400000000002]
[30,15.1776,21.277200000000001,37.760400000000004,40.891800000000003,43.033799999999999,45.114599999999996,45.991800000000005,47.419800000000002,47.419800000000002,51.102000000000004,null,30,16.767600000000002,22.8672,39.350400000000008,42.481800000000007,44.623800000000003,46.704599999999999,47.581800000000008,49.009800000000006,49.009800000000006,52.692000000000007]
[31,15.861000000000001,22.052400000000002,38.566200000000002,41.830199999999998,44.767800000000001,46.0428,47.542200000000001,48.276599999999995,48.276599999999995,52.774799999999999,null,31,17.451000000000001,23.642400000000002,40.156200000000005,43.420200000000001,46.357800000000005,47.632800000000003,49.132200000000005,49.866599999999998,49.866599999999998,54.364800000000002]
[32,16.309799999999999,22.5624,39.423000000000002,42.768599999999999,45.6858,46.960799999999999,48.45,49.174199999999999,49.174199999999999,53.907000000000004,null,32,17.899799999999999,24.1524,41.013000000000005,44.358600000000003,47.275800000000004,48.550800000000002,50.040000000000006,50.764200000000002,50.764200000000002,55.497000000000007]
[33,16.687200000000001,23.133600000000001,40.1676,43.676400000000001,46.624200000000002,48.011400000000002,49.551600000000001,50.296199999999999,50.296199999999999,55.069800000000001,null,33,18.277200000000001,24.723600000000001,41.757600000000004,45.266400000000004,48.214200000000005,49.601400000000005,51.141600000000004,51.886200000000002,51.886200000000002,56.659800000000004]
[34,17.054399999999998,23.490600000000001,41.095799999999997,44.604599999999998,47.623799999999996,49.041599999999995,50.591999999999999,51.316200000000002,51.316200000000002,56.120400000000004,null,34,18.644399999999997,25.0806,42.6858,46.194600000000001,49.213799999999999,50.631599999999999,52.182000000000002,52.906200000000005,52.906200000000005,57.710400000000007]
[35,17.421599999999998,23.929200000000002,42.003599999999999,45.542999999999999,48.531599999999997,50.082000000000001,51.581400000000002,52.366800000000005,52.366800000000005,57.242399999999996,null,35,19.011599999999998,25.519200000000001,43.593600000000002,47.133000000000003,50.121600000000001,51.672000000000004,53.171400000000006,53.956800000000008,53.956800000000008,58.8324]
[36,18.003,24.296400000000002,42.9114,46.450800000000001,49.480199999999996,51.183599999999998,52.591200000000001,53.366399999999999,53.366399999999999,58.497,null,36,19.593,25.886400000000002,44.501400000000004,48.040800000000004,51.0702,52.773600000000002,54.181200000000004,54.956400000000002,54.956400000000002,60.087000000000003]
[37,18.013200000000001,24.99,43.757999999999996,47.3994,50.479800000000004,52.315799999999996,53.692799999999998,54.498599999999996,54.498599999999996,59.445599999999999,null,37,19.603200000000001,26.58,45.347999999999999,48.989400000000003,52.069800000000008,53.905799999999999,55.282800000000002,56.0886,56.0886,61.035600000000002]
[38,18.2988,25.387800000000002,44.522999999999996,48.235799999999998,51.438600000000001,53.5398,54.702600000000004,55.518599999999999,55.518599999999999,60.608400000000003,null,38,19.8888,26.977800000000002,46.113,49.825800000000001,53.028600000000004,55.129800000000003,56.292600000000007,57.108600000000003,57.108600000000003,62.198400000000007]
[39,18.900600000000001,25.8264,45.349200000000003,49.133400000000002,52.407600000000002,54.641399999999997,55.794000000000004,56.61,56.61,60.628799999999998,null,39,20.490600000000001,27.416399999999999,46.939200000000007,50.723400000000005,53.997600000000006,56.231400000000001,57.384000000000007,58.2,58.2,62.218800000000002]
[40,18.910799999999998,26.265000000000001,46.185600000000001,50.061599999999999,53.335799999999999,55.692,56.926200000000001,57.752399999999994,57.752399999999994,60.639000000000003,null,40,20.500799999999998,27.855,47.775600000000004,51.651600000000002,54.925800000000002,57.282000000000004,58.516200000000005,59.342399999999998,59.342399999999998,62.229000000000006]
[41,19.532999999999998,26.805600000000002,47.001599999999996,51.010199999999998,54.355800000000002,56.599800000000002,57.987000000000002,58.864200000000004,58.864200000000004,64.423199999999994,null,41,21.122999999999998,28.395600000000002,48.5916,52.600200000000001,55.945800000000006,58.189800000000005,59.577000000000005,60.454200000000007,60.454200000000007,66.013199999999998]
[42,19.8186,27.3462,47.9298,51.928199999999997,55.467600000000004,57.915599999999998,59.180400000000006,60.077999999999996,60.077999999999996,65.44319999999999,null,42,21.4086,28.936199999999999,49.519800000000004,53.5182,57.057600000000008,59.505600000000001,60.770400000000009,61.667999999999999,61.667999999999999,67.033199999999994]
[43,20.338800000000003,27.856199999999998,48.878399999999999,52.846200000000003,56.497799999999998,58.854000000000006,60.394199999999998,61.281599999999997,61.281599999999997,66.504000000000005,null,43,21.928800000000003,29.446199999999997,50.468400000000003,54.436200000000007,58.087800000000001,60.44400000000001,61.984200000000001,62.871600000000001,62.871600000000001,68.094000000000008]
[44,20.797800000000002,28.407,49.694400000000002,53.7744,57.487200000000001,59.8842,61.679400000000001,62.607600000000005,62.607600000000005,67.758600000000001,null,44,22.387800000000002,29.997,51.284400000000005,55.364400000000003,59.077200000000005,61.474200000000003,63.269400000000005,64.197600000000008,64.197600000000008,69.348600000000005]
[45,21.2364,28.9986,50.591999999999999,54.692399999999999,58.609200000000001,60.924599999999998,62.668799999999997,63.597000000000001,63.597000000000001,69.033600000000007,null,45,22.8264,30.5886,52.182000000000002,56.282400000000003,60.199200000000005,62.514600000000002,64.258799999999994,65.186999999999998,65.186999999999998,70.62360000000001]
[46,21.644399999999997,29.620799999999999,51.479399999999998,55.620600000000003,59.720999999999997,61.975200000000001,63.770400000000002,64.719000000000008,64.719000000000008,69.920999999999992,null,46,23.234399999999997,31.210799999999999,53.069400000000002,57.210600000000007,61.311,63.565200000000004,65.360399999999998,66.309000000000012,66.309000000000012,71.510999999999996]
[47,22.011599999999998,30.2532,52.377000000000002,56.467199999999998,60.822600000000001,62.8626,64.780199999999994,65.759399999999999,65.759399999999999,69.941399999999987,null,47,23.601599999999998,31.8432,53.967000000000006,58.057200000000002,62.412600000000005,64.452600000000004,66.370199999999997,67.349400000000003,67.349400000000003,71.531399999999991]
[48,22.154399999999999,30.844799999999999,53.121600000000001,57.395400000000002,61.924199999999999,64.004999999999995,65.983800000000002,66.973199999999991,66.973199999999991,71.4816,null,48,23.744399999999999,32.434800000000003,54.711600000000004,58.985400000000006,63.514200000000002,65.594999999999999,67.573800000000006,68.563199999999995,68.563199999999995,73.071600000000004]
[49,22.3278,31.558800000000002,53.876400000000004,57.558599999999998,61.944599999999994,65.025000000000006,67.156800000000004,68.156399999999991,68.156399999999991,71.501999999999995,null,49,23.9178,33.148800000000001,55.466400000000007,59.148600000000002,63.534599999999998,66.615000000000009,68.746800000000007,69.746399999999994,69.746399999999994,73.091999999999999]
[50,22.337999999999997,31.599599999999999,53.896800000000006,57.579000000000001,61.954799999999999,65.035200000000003,67.177199999999999,68.166600000000003,68.166600000000003,71.512199999999993,null,50,23.927999999999997,33.189599999999999,55.486800000000009,59.169000000000004,63.544800000000002,66.625200000000007,68.767200000000003,69.756600000000006,69.756600000000006,73.102199999999996]
[51,23.541599999999999,32.874599999999994,55.59,60.159599999999998,65.331000000000003,67.279199999999989,69.737400000000008,70.757400000000004,70.757400000000004,73.899000000000001,null,51,25.131599999999999,34.464599999999997,57.180000000000007,61.749600000000001,66.921000000000006,68.869199999999992,71.327400000000011,72.347400000000007,72.347400000000007,75.489000000000004]
[52,23.898599999999998,33.568199999999997,56.457000000000001,61.077600000000004,66.432599999999994,68.380800000000008,71.104199999999992,72.165000000000006,72.165000000000006,76.357200000000006,null,52,25.488599999999998,35.158200000000001,58.047000000000004,62.667600000000007,68.022599999999997,69.970800000000011,72.694199999999995,73.75500000000001,73.75500000000001,77.947200000000009]
[53,24.367799999999999,34.119,57.313800000000001,62.0976,67.625999999999991,69.502800000000008,72.297599999999989,73.38900000000001,73.38900000000001,76.377600000000001,null,53,25.957799999999999,35.709000000000003,58.903800000000004,63.687600000000003,69.215999999999994,71.092800000000011,73.887599999999992,74.979000000000013,74.979000000000013,77.967600000000004]
[54,24.765600000000003,34.802399999999999,58.2624,63.015599999999999,68.646000000000001,70.849199999999996,73.664400000000001,74.755800000000008,74.755800000000008,78.468600000000009,null,54,26.355600000000003,36.392400000000002,59.852400000000003,64.605599999999995,70.236000000000004,72.4392,75.254400000000004,76.345800000000011,76.345800000000011,80.058600000000013]
[55,25.1328,35.434800000000003,59.2926,63.872399999999999,69.686399999999992,72.022199999999998,74.755800000000008,75.888000000000005,75.888000000000005,81.008399999999995,null,55,26.722799999999999,37.024800000000006,60.882600000000004,65.462400000000002,71.276399999999995,73.612200000000001,76.345800000000011,77.478000000000009,77.478000000000009,82.598399999999998]
[56,25.602,36.118199999999995,60.373799999999996,64.617000000000004,70.777799999999999,73.358400000000003,75.959400000000002,77.101799999999997,77.101799999999997,81.028800000000004,null,56,27.192,37.708199999999998,61.963799999999999,66.207000000000008,72.367800000000003,74.948400000000007,77.549400000000006,78.691800000000001,78.691800000000001,82.618800000000007]
[57,26.081399999999999,36.740400000000001,61.465199999999996,65.769599999999997,71.797799999999995,74.561999999999998,77.265000000000001,78.397199999999998,78.397199999999998,83.385000000000005,null,57,27.671399999999998,38.330400000000004,63.055199999999999,67.3596,73.387799999999999,76.152000000000001,78.855000000000004,79.987200000000001,79.987200000000001,84.975000000000009]
[58,26.6526,37.352399999999996,62.576999999999998,66.667199999999994,72.8994,75.888000000000005,78.631799999999998,79.794600000000003,79.794600000000003,83.4054,null,58,28.242599999999999,38.942399999999999,64.167000000000002,68.257199999999997,74.489400000000003,77.478000000000009,80.221800000000002,81.384600000000006,81.384600000000006,84.995400000000004]
[59,27.03,37.974599999999995,63.668399999999998,67.483199999999997,74.000999999999991,77.081399999999988,80.019000000000005,81.202200000000005,81.202200000000005,84.649799999999999,null,59,28.62,39.564599999999999,65.258399999999995,69.0732,75.590999999999994,78.671399999999991,81.609000000000009,82.792200000000008,82.792200000000008,86.239800000000002]
[60,27.3156,38.239800000000002,64.708799999999997,68.635800000000003,75.194400000000002,78.397199999999998,80.977800000000002,82.171199999999999,82.171199999999999,85.730999999999995,null,60,28.9056,39.829800000000006,66.2988,70.225800000000007,76.784400000000005,79.987200000000001,82.567800000000005,83.761200000000002,83.761200000000002,87.320999999999998]
[61,28.05,39.290400000000005,65.810400000000001,69.502800000000008,76.387799999999999,79.600800000000007,80.998199999999997,83.986800000000002,83.986800000000002,89.076599999999999,null,61,29.64,40.880400000000009,67.400400000000005,71.092800000000011,77.977800000000002,81.19080000000001,82.588200000000001,85.576800000000006,85.576800000000006,90.666600000000003]
[62,28.723199999999999,40.004399999999997,66.8202,70.828800000000001,77.581199999999995,80.906399999999991,84.027599999999993,85.271999999999991,85.271999999999991,90.127200000000002,null,62,30.313199999999998,41.5944,68.410200000000003,72.418800000000005,79.171199999999999,82.496399999999994,85.617599999999996,86.861999999999995,86.861999999999995,91.717200000000005]
[63,29.2026,40.779599999999995,67.952400000000011,71.848799999999997,78.856200000000001,82.314000000000007,85.4148,86.689799999999991,86.689799999999991,91.239000000000004,null,63,30.7926,42.369599999999998,69.542400000000015,73.438800000000001,80.446200000000005,83.904000000000011,87.004800000000003,88.279799999999994,88.279799999999994,92.829000000000008]
[64,29.753400000000003,41.5854,69.054000000000002,73.052400000000006,80.171999999999997,83.731800000000007,86.791800000000009,88.066800000000001,88.066800000000001,93.309600000000003,null,64,31.343400000000003,43.175400000000003,70.644000000000005,74.642400000000009,81.762,85.32180000000001,88.381800000000013,89.656800000000004,89.656800000000004,94.899600000000007]
[65,29.937000000000001,42.381,70.063800000000001,74.235600000000005,81.446999999999989,85.221000000000004,87.964799999999997,88.087199999999996,88.087199999999996,93.33,null,65,31.527000000000001,43.971000000000004,71.653800000000004,75.825600000000009,83.036999999999992,86.811000000000007,89.5548,89.677199999999999,89.677199999999999,94.92]
[66,30.8142,43.145999999999994,71.1858,75.4392,82.721999999999994,86.618400000000008,89.5458,90.871800000000007,90.871800000000007,95.114999999999995,null,66,32.404200000000003,44.735999999999997,72.775800000000004,77.029200000000003,84.311999999999998,88.208400000000012,91.135800000000003,92.461800000000011,92.461800000000011,96.704999999999998]
[67,30.957000000000001,43.972200000000001,72.205800000000011,76.754999999999995,84.129600000000011,88.107599999999991,91.096199999999996,92.452799999999996,92.452799999999996,96.695999999999998,null,67,32.547000000000004,45.562200000000004,73.795800000000014,78.344999999999999,85.719600000000014,89.697599999999994,92.686199999999999,94.0428,94.0428,98.286000000000001]
[68,31.926000000000002,44.737200000000001,73.317599999999999,78.03,85.4148,88.128,92.564999999999998,93.93180000000001,93.93180000000001,98.725800000000007,null,68,33.516000000000005,46.327200000000005,74.907600000000002,79.62,87.004800000000003,89.718000000000004,94.155000000000001,95.521800000000013,95.521800000000013,100.31580000000001]
[69,32.4054,45.542999999999999,74.409000000000006,79.325400000000002,85.435200000000009,88.566599999999994,94.125600000000006,95.52300000000001,95.52300000000001,100.3272,null,69,33.995400000000004,47.133000000000003,75.999000000000009,80.915400000000005,87.025200000000012,90.156599999999997,95.715600000000009,97.113000000000014,97.113000000000014,101.91720000000001]
[70,32.415599999999998,45.889800000000001,74.419199999999989,80.539199999999994,86.720399999999998,89.668199999999999,95.410800000000009,96.818399999999997,96.818399999999997,101.78580000000001,null,70,34.005600000000001,47.479800000000004,76.009199999999993,82.129199999999997,88.310400000000001,91.258200000000002,97.000800000000012,98.4084,98.4084,103.37580000000001]
[71,33.5274,47.185199999999995,76.561199999999999,81.834600000000009,87.118200000000002,90.9024,97.134600000000006,98.572800000000001,98.572800000000001,103.2954,null,71,35.117400000000004,48.775199999999998,78.151200000000003,83.424600000000012,88.708200000000005,92.492400000000004,98.724600000000009,100.1628,100.1628,104.8854]
[72,33.8232,47.572800000000001,76.571399999999997,83.140200000000007,88.179000000000002,92.085599999999999,97.155000000000001,98.583000000000013,98.583000000000013,105.26400000000001,null,72,35.413200000000003,49.162800000000004,78.1614,84.730200000000011,89.769000000000005,93.675600000000003,98.745000000000005,100.17300000000002,100.17300000000002,106.85400000000001]
[73,33.833400000000005,48.878399999999999,76.60199999999999,83.150399999999991,89.382599999999996,93.544199999999989,98.858400000000003,100.28639999999999,100.28639999999999,108.1812,null,73,35.423400000000008,50.468400000000003,78.191999999999993,84.740399999999994,90.9726,95.134199999999993,100.44840000000001,101.87639999999999,101.87639999999999,109.77120000000001]
[74,33.843600000000002,49.673999999999999,77.591399999999993,85.710599999999999,90.790199999999999,97.348799999999997,99.296999999999997,100.30680000000001,100.30680000000001,108.19139999999999,null,74,35.433600000000006,51.264000000000003,79.181399999999996,87.300600000000003,92.380200000000002,98.938800000000001,100.887,101.89680000000001,101.89680000000001,109.78139999999999]
[75,33.864000000000004,50.092199999999998,79.794600000000003,85.730999999999995,91.483800000000002,98.685000000000002,100.30680000000001,100.31699999999999,100.31699999999999,108.2118,null,75,35.454000000000008,51.682200000000002,81.384600000000006,87.320999999999998,93.073800000000006,100.27500000000001,101.89680000000001,101.907,101.907,109.8018]
[76,35.9754,51.3264,81.916200000000003,88.209600000000009,93.278999999999996,98.685000000000002,103.9278,104.49900000000001,104.49900000000001,112.9752,null,76,37.565400000000004,52.916400000000003,83.506200000000007,89.799600000000012,94.869,100.27500000000001,105.51780000000001,106.08900000000001,106.08900000000001,114.5652]
[77,35.995800000000003,51.652799999999999,82.2834,88.23,94.503,99.296999999999997,104.142,106.87560000000001,106.87560000000001,112.9854,null,77,37.585800000000006,53.242800000000003,83.873400000000004,89.820000000000007,96.093000000000004,100.887,105.732,108.46560000000001,108.46560000000001,114.5754]
[78,35.995800000000003,51.948599999999999,82.293600000000012,88.689000000000007,95.676000000000002,100.6026,105.74340000000001,108.2628,108.2628,113.95439999999999,null,78,37.585800000000006,53.538600000000002,83.883600000000015,90.279000000000011,97.266000000000005,102.1926,107.33340000000001,109.8528,109.8528,115.5444]
[79,36.006,53.142000000000003,82.5792,91.218600000000009,96.910200000000003,101.98979999999999,107.2938,109.6602,109.6602,116.1168,null,79,37.596000000000004,54.732000000000006,84.169200000000004,92.808600000000013,98.500200000000007,103.57979999999999,108.88380000000001,111.25020000000001,111.25020000000001,117.7068]
[80,36.026400000000002,53.152200000000001,83.221800000000002,91.310400000000001,97.41,103.51979999999999,108.2526,111.05759999999999,111.05759999999999,117.1878,null,80,37.616400000000006,54.742200000000004,84.811800000000005,92.900400000000005,99,105.10979999999999,109.8426,112.6476,112.6476,118.7778]
[81,38.454000000000001,54.202800000000003,84.2316,92.422200000000004,98.970600000000005,104.86620000000001,109.9662,111.078,111.078,117.504,null,81,40.044000000000004,55.792800000000007,85.821600000000004,94.012200000000007,100.56060000000001,106.45620000000001,111.5562,112.66800000000001,112.66800000000001,119.09400000000001]
[82,39.065999999999995,55.936800000000005,87.046800000000005,95.268000000000001,99.694800000000001,106.3656,112.07759999999999,113.7402,113.7402,121.2372,null,82,40.655999999999999,57.526800000000009,88.636800000000008,96.858000000000004,101.2848,107.9556,113.66759999999999,115.3302,115.3302,122.8272]
[83,39.514800000000001,56.61,87.189599999999999,95.268000000000001,101.5716,107.88539999999999,112.8222,114.06659999999999,114.06659999999999,121.26779999999999,null,83,41.104800000000004,58.2,88.779600000000002,96.858000000000004,103.16160000000001,109.47539999999999,114.4122,115.6566,115.6566,122.8578]
[84,39.535199999999996,56.701800000000006,88.128,95.910600000000002,101.592,109.446,114.06659999999999,114.1074,114.1074,121.27800000000001,null,84,41.1252,58.291800000000009,89.718000000000004,97.500600000000006,103.182,111.036,115.6566,115.6974,115.6974,122.86800000000001]
[85,39.545400000000001,57.4056,89.5458,98.674799999999991,103.99919999999999,110.8638,115.464,115.566,115.566,124.0116,null,85,41.135400000000004,58.995600000000003,91.135800000000003,100.26479999999999,105.58919999999999,112.4538,117.054,117.15600000000001,117.15600000000001,125.6016]
[86,40.820400000000006,58.119599999999998,91.443000000000012,98.685000000000002,104.0196,112.24080000000001,116.84099999999999,118.03440000000001,118.03440000000001,124.032,null,86,42.41040000000001,59.709600000000002,93.033000000000015,100.27500000000001,105.6096,113.83080000000001,118.431,119.62440000000001,119.62440000000001,125.622]
[87,40.840800000000002,59.3538,92.860800000000012,99.633600000000001,104.0196,113.8116,118.13639999999999,119.3502,119.3502,128.01,null,87,42.430800000000005,60.943800000000003,94.450800000000015,101.2236,105.6096,115.4016,119.7264,120.9402,120.9402,129.6]
[88,40.850999999999999,59.496600000000001,93.768600000000006,100.7148,107.05919999999999,115.07639999999999,120.3396,121.0128,121.0128,128.03039999999999,null,88,42.441000000000003,61.086600000000004,95.35860000000001,102.3048,108.64919999999999,116.6664,121.92960000000001,122.6028,122.6028,129.62039999999999]
[89,40.871400000000001,59.506800000000005,95.676000000000002,101.7756,112.42440000000001,116.3616,120.97199999999999,123.1752,123.1752,131.83500000000001,null,89,42.461400000000005,61.096800000000009,97.266000000000005,103.3656,114.01440000000001,117.9516,122.562,124.76520000000001,124.76520000000001,133.42500000000001]
[90,40.881599999999999,59.517000000000003,97.226399999999998,102.8976,112.4346,117.62639999999999,122.247,123.1956,123.1956,133.55879999999999,null,90,42.471600000000002,61.107000000000006,98.816400000000002,104.4876,114.02460000000001,119.21639999999999,123.837,124.7856,124.7856,135.14879999999999]
[91,43.247999999999998,62.087399999999995,98.531999999999996,104.1828,114.90300000000001,118.983,123.6036,126.327,126.327,136.06800000000001,null,91,44.838000000000001,63.677399999999999,100.122,105.7728,116.49300000000001,120.57300000000001,125.1936,127.917,127.917,137.65800000000002]
[92,43.278599999999997,62.0976,99.827400000000011,105.621,114.93360000000001,121.0128,125.358,127.71419999999999,127.71419999999999,137.292,null,92,44.868600000000001,63.687600000000003,101.41740000000001,107.211,116.52360000000002,122.6028,126.94800000000001,129.30419999999998,129.30419999999998,138.88200000000001]
[93,43.288799999999995,62.301600000000001,101.02080000000001,106.9062,114.9438,122.32860000000001,126.3678,129.09120000000001,129.09120000000001,137.3124,null,93,44.878799999999998,63.891600000000004,102.61080000000001,108.4962,116.5338,123.91860000000001,127.95780000000001,130.68120000000002,130.68120000000002,138.9024]
[94,43.298999999999999,62.9238,102.255,108.12,115.2294,122.9406,127.64279999999999,130.39680000000001,130.39680000000001,140.80079999999998,null,94,44.889000000000003,64.513800000000003,103.845,109.71000000000001,116.8194,124.53060000000001,129.2328,131.98680000000002,131.98680000000002,142.39079999999998]
[95,43.298999999999999,62.934000000000005,103.20360000000001,109.3134,116.535,124.1238,129.09120000000001,130.40699999999998,130.40699999999998,140.81100000000001,null,95,44.889000000000003,64.524000000000001,104.79360000000001,110.9034,118.125,125.71380000000001,130.68120000000002,131.99699999999999,131.99699999999999,142.40100000000001]
[96,45.828600000000002,65.412599999999998,104.32559999999999,110.5068,117.8202,125.4906,130.37639999999999,130.42740000000001,130.42740000000001,140.8314,null,96,47.418600000000005,67.002600000000001,105.9156,112.0968,119.4102,127.0806,131.96639999999999,132.01740000000001,132.01740000000001,142.42140000000001]
[97,46.236599999999996,65.504400000000004,105.38639999999999,111.843,121.2882,127.6326,132.63060000000002,133.35480000000001,133.35480000000001,140.8416,null,97,47.826599999999999,67.094400000000007,106.9764,113.43300000000001,122.87820000000001,129.2226,134.22060000000002,134.94480000000001,134.94480000000001,142.4316]
[98,46.257000000000005,66.208199999999991,106.4982,111.8532,121.30860000000001,128.12219999999999,133.161,133.48740000000001,133.48740000000001,146.6352,null,98,47.847000000000008,67.798199999999994,108.0882,113.4432,122.89860000000002,129.7122,134.751,135.07740000000001,135.07740000000001,148.2252]
[99,47.215800000000002,66.279600000000002,107.3652,114.2298,121.5228,129.489,134.52779999999998,134.946,134.946,149.5626,null,99,48.805800000000005,67.869600000000005,108.9552,115.8198,123.11280000000001,131.07900000000001,136.11779999999999,136.536,136.536,151.15260000000001]
[100,47.613599999999998,67.575000000000003,108.0792,115.4436,125.8272,131.0292,135.95579999999998,138.1386,138.1386,149.57279999999997,null,100,49.203600000000002,69.165000000000006,109.6692,117.03360000000001,127.41720000000001,132.61920000000001,137.54579999999999,139.7286,139.7286,151.16279999999998]
[101,48.072600000000001,68.238,109.17060000000001,116.586,127.092,132.345,137.3124,139.5258,139.5258,151.0926,null,101,49.662600000000005,69.828000000000003,110.76060000000001,118.176,128.68199999999999,133.935,138.9024,141.11580000000001,141.11580000000001,152.68260000000001]
[102,48.552,68.921399999999991,110.2212,117.7488,128.3364,133.6506,138.66899999999998,140.90279999999998,140.90279999999998,152.60220000000001,null,102,50.142000000000003,70.511399999999995,111.8112,119.33880000000001,129.9264,135.2406,140.25899999999999,142.49279999999999,142.49279999999999,154.19220000000001]
[103,49.031399999999998,69.5946,111.31259999999999,118.9014,129.6114,134.9562,140.03579999999999,142.29,142.29,154.11180000000002,null,103,50.621400000000001,71.184600000000003,112.90259999999999,120.4914,131.20140000000001,136.5462,141.6258,143.88,143.88,155.70180000000002]
[104,49.500599999999999,70.278000000000006,112.3938,120.0438,130.86600000000001,136.27199999999999,141.39240000000001,143.667,143.667,155.62139999999999,null,104,51.090600000000002,71.868000000000009,113.9838,121.63380000000001,132.45600000000002,137.86199999999999,142.98240000000001,145.25700000000001,145.25700000000001,157.2114]
[105,49.98,70.941000000000003,113.48520000000001,121.20659999999999,132.1206,137.57759999999999,142.749,145.05420000000001,145.05420000000001,157.1412,null,105,51.57,72.531000000000006,115.07520000000001,122.7966,133.7106,139.16759999999999,144.339,146.64420000000001,146.64420000000001,158.7312]
[106,50.459400000000002,71.624399999999994,114.54599999999999,122.3694,133.3854,138.89339999999999,144.11579999999998,146.43119999999999,146.43119999999999,158.661,null,106,52.049400000000006,73.214399999999998,116.136,123.9594,134.97540000000001,140.48339999999999,145.70579999999998,148.02119999999999,148.02119999999999,160.251]
[107,50.938800000000001,72.297599999999989,115.6374,123.52199999999999,134.65019999999998,140.19899999999998,145.47239999999999,147.8184,147.8184,160.16040000000001,null,107,52.528800000000004,73.887599999999992,117.2274,125.11199999999999,136.24019999999999,141.78899999999999,147.0624,149.4084,149.4084,161.75040000000001]
[108,51.397800000000004,72.970800000000011,116.71860000000001,124.6848,135.8946,141.50459999999998,146.81880000000001,149.19540000000001,149.19540000000001,161.68019999999999,null,108,52.987800000000007,74.560800000000015,118.30860000000001,126.2748,137.4846,143.09459999999999,148.40880000000001,150.78540000000001,150.78540000000001,163.27019999999999]
[109,51.877200000000002,73.654199999999989,117.81,125.8272,137.15940000000001,142.82040000000001,148.18559999999999,150.58259999999999,150.58259999999999,163.18980000000002,null,109,53.467200000000005,75.244199999999992,119.4,127.41720000000001,138.74940000000001,144.41040000000001,149.7756,152.17259999999999,152.17259999999999,164.77980000000002]
[110,52.366800000000005,74.3172,118.8708,126.9798,138.41399999999999,144.126,149.54220000000001,151.95959999999999,151.95959999999999,164.70959999999999,null,110,53.956800000000008,75.907200000000003,120.46080000000001,128.56979999999999,140.00399999999999,145.71600000000001,151.13220000000001,153.5496,153.5496,166.2996]
[111,52.825800000000001,75.000600000000006,119.9622,128.14259999999999,139.6788,145.4316,150.90899999999999,153.3468,153.3468,166.2192,null,111,54.415800000000004,76.590600000000009,121.5522,129.73259999999999,141.2688,147.02160000000001,152.499,154.93680000000001,154.93680000000001,167.8092]
[112,53.315400000000004,75.6738,121.04340000000001,129.285,140.92320000000001,146.7474,152.26560000000001,154.72380000000001,154.72380000000001,167.72880000000001,null,112,54.905400000000007,77.263800000000003,122.63340000000001,130.875,142.51320000000001,148.3374,153.85560000000001,156.31380000000001,156.31380000000001,169.31880000000001]
[113,53.794800000000002,76.357200000000006,122.1348,130.4376,142.19819999999999,148.053,153.63240000000002,156.11100000000002,156.11100000000002,169.24860000000001,null,113,55.384800000000006,77.947200000000009,123.7248,132.02760000000001,143.78819999999999,149.643,155.22240000000002,157.70100000000002,157.70100000000002,170.83860000000001]
[114,54.2742,77.0304,123.20580000000001,131.60040000000001,143.4528,149.36879999999999,154.98899999999998,157.488,157.488,170.75819999999999,null,114,55.864200000000004,78.620400000000004,124.79580000000001,133.19040000000001,145.0428,150.9588,156.57899999999998,159.078,159.078,172.34819999999999]
[115,54.743400000000001,77.703600000000009,124.28699999999999,132.75300000000001,144.70740000000001,150.67439999999999,156.34559999999999,158.87519999999998,158.87519999999998,172.26779999999999,null,115,56.333400000000005,79.293600000000012,125.877,134.34300000000002,146.29740000000001,152.26439999999999,157.93559999999999,160.46519999999998,160.46519999999998,173.8578]
[116,55.212600000000002,78.387,125.3784,133.90559999999999,145.96199999999999,151.97999999999999,157.7124,160.23179999999999,160.23179999999999,173.7876,null,116,56.802600000000005,79.977000000000004,126.9684,135.4956,147.55199999999999,153.57,159.30240000000001,161.8218,161.8218,175.3776]
[117,55.692,79.05,126.4392,135.0684,147.23699999999999,153.29579999999999,159.05879999999999,161.619,161.619,175.2972,null,117,57.282000000000004,80.64,128.0292,136.6584,148.827,154.88579999999999,160.64879999999999,163.209,163.209,176.88720000000001]
[118,56.161200000000001,79.733400000000003,127.53060000000001,136.221,148.48139999999998,154.62180000000001,160.4256,162.99600000000001,162.99600000000001,176.81700000000001,null,118,57.751200000000004,81.323400000000007,129.1206,137.81100000000001,150.07139999999998,156.21180000000001,162.01560000000001,164.58600000000001,164.58600000000001,178.40700000000001]
[119,56.640599999999999,80.3964,128.61180000000002,137.36339999999998,149.74620000000002,155.9376,161.78220000000002,164.38319999999999,164.38319999999999,178.31639999999999,null,119,58.230600000000003,81.986400000000003,130.20180000000002,138.95339999999999,151.33620000000002,157.52760000000001,163.37220000000002,165.97319999999999,165.97319999999999,179.90639999999999]
[120,57.12,81.079799999999992,129.70320000000001,138.52619999999999,151.0008,157.2432,163.149,165.7602,165.7602,179.83619999999999,null,120,58.71,82.669799999999995,131.29320000000001,140.11619999999999,152.5908,158.83320000000001,164.739,167.3502,167.3502,181.42619999999999]
[121,57.6096,81.763199999999998,130.76399999999998,139.6788,152.25540000000001,158.5488,164.49540000000002,167.1474,167.1474,181.35600000000002,null,121,59.199600000000004,83.353200000000001,132.35399999999998,141.2688,153.84540000000001,160.1388,166.08540000000002,168.73740000000001,168.73740000000001,182.94600000000003]
[122,58.068599999999996,82.436399999999992,131.8554,140.8314,153.51,159.8646,165.8724,168.52439999999999,168.52439999999999,182.8656,null,122,59.6586,84.026399999999995,133.44540000000001,142.42140000000001,155.1,161.4546,167.4624,170.11439999999999,170.11439999999999,184.4556]
[123,58.548000000000002,83.1096,132.9264,141.99420000000001,154.7646,161.17019999999999,167.21879999999999,169.91160000000002,169.91160000000002,184.37519999999998,null,123,60.138000000000005,84.699600000000004,134.5164,143.58420000000001,156.3546,162.7602,168.80879999999999,171.50160000000002,171.50160000000002,185.96519999999998]
[124,59.0274,83.772599999999997,134.01779999999999,143.13660000000002,156.03959999999998,162.47579999999999,168.5754,171.2988,171.2988,185.88480000000001,null,124,60.617400000000004,85.3626,135.6078,144.72660000000002,157.62959999999998,164.0658,170.16540000000001,172.8888,172.8888,187.47480000000002]
[125,59.496600000000001,84.466200000000001,135.08879999999999,144.28919999999999,157.28399999999999,163.79160000000002,169.94220000000001,172.67579999999998,172.67579999999998,187.40459999999999,null,125,61.086600000000004,86.056200000000004,136.6788,145.8792,158.874,165.38160000000002,171.53220000000002,174.26579999999998,174.26579999999998,188.99459999999999]
[126,59.975999999999999,85.129199999999997,136.18019999999999,145.46220000000002,158.5488,165.09720000000002,171.2988,174.06300000000002,174.06300000000002,188.92439999999999,null,126,61.566000000000003,86.719200000000001,137.77019999999999,147.05220000000003,160.1388,166.68720000000002,172.8888,175.65300000000002,175.65300000000002,190.51439999999999]
[127,60.455400000000004,85.812599999999989,137.25120000000001,146.60459999999998,159.80339999999998,166.41300000000001,172.66560000000001,175.44,175.44,190.4238,null,127,62.045400000000008,87.402599999999993,138.84120000000001,148.19459999999998,161.39339999999999,168.00300000000001,174.25560000000002,177.03,177.03,192.0138]
[128,60.934800000000003,86.485800000000012,138.3426,147.75720000000001,161.06819999999999,167.71860000000001,174.012,176.8272,176.8272,191.9436,null,128,62.524800000000006,88.075800000000015,139.93260000000001,149.34720000000002,162.65819999999999,169.30860000000001,175.602,178.41720000000001,178.41720000000001,193.53360000000001]
[129,61.404000000000003,87.169199999999989,139.4238,148.91999999999999,162.3126,169.02420000000001,175.38899999999998,178.20420000000001,178.20420000000001,193.45320000000001,null,129,62.994000000000007,88.759199999999993,141.0138,150.51,163.90260000000001,170.61420000000001,176.97899999999998,179.79420000000002,179.79420000000002,195.04320000000001]
[130,61.883400000000002,87.842399999999998,140.4846,150.07259999999999,163.57740000000001,170.34,176.7354,179.59139999999999,179.59139999999999,194.97300000000001,null,130,63.473400000000005,89.432400000000001,142.0746,151.6626,165.16740000000001,171.93,178.3254,181.1814,181.1814,196.56300000000002]
[131,62.352600000000002,88.525800000000004,141.57600000000002,151.215,164.84220000000002,171.6456,178.10220000000001,180.96839999999997,180.96839999999997,196.48259999999999,null,131,63.942600000000006,90.115800000000007,143.16600000000003,152.80500000000001,166.43220000000002,173.23560000000001,179.69220000000001,182.55839999999998,182.55839999999998,198.07259999999999]
[132,62.821800000000003,89.188800000000001,142.64699999999999,152.37779999999998,166.0968,172.9614,179.4588,182.34540000000001,182.34540000000001,197.99220000000003,null,132,64.411799999999999,90.778800000000004,144.23699999999999,153.96779999999998,167.68680000000001,174.5514,181.0488,183.93540000000002,183.93540000000002,199.58220000000003]
[133,63.301200000000001,89.851799999999997,143.73839999999998,153.53040000000001,167.35139999999998,174.267,180.81540000000001,183.72239999999999,183.72239999999999,199.512,null,133,64.891199999999998,91.441800000000001,145.32839999999999,155.12040000000002,168.94139999999999,175.857,182.40540000000001,185.3124,185.3124,201.102]
[134,63.790799999999997,90.545400000000001,144.80940000000001,154.6728,168.62639999999999,175.57259999999999,182.172,185.1096,185.1096,201.02160000000001,null,134,65.380799999999994,92.135400000000004,146.39940000000001,156.2628,170.21639999999999,177.1626,183.762,186.6996,186.6996,202.61160000000001]
[135,64.270200000000003,91.218600000000009,145.9008,155.8356,169.8708,176.88839999999999,183.53880000000001,186.48660000000001,186.48660000000001,202.53120000000001,null,135,65.860200000000006,92.808600000000013,147.49080000000001,157.4256,171.46080000000001,178.47839999999999,185.12880000000001,188.07660000000001,188.07660000000001,204.12120000000002]
[136,64.739400000000003,91.891800000000003,146.9616,156.99839999999998,171.13560000000001,178.19399999999999,184.89540000000002,187.87379999999999,187.87379999999999,204.05100000000002,null,136,66.329400000000007,93.481800000000007,148.55160000000001,158.58839999999998,172.72560000000001,179.78399999999999,186.48540000000003,189.46379999999999,189.46379999999999,205.64100000000002]
[137,65.218800000000002,92.564999999999998,148.053,158.15100000000001,172.38,179.50980000000001,186.25199999999998,189.2508,189.2508,205.56059999999999,null,137,66.808800000000005,94.155000000000001,149.643,159.74100000000001,173.97,181.09980000000002,187.84199999999998,190.8408,190.8408,207.1506]
[138,65.688000000000002,93.258600000000001,149.13420000000002,159.31379999999999,173.655,180.82560000000001,187.61879999999999,190.63800000000001,190.63800000000001,207.0804,null,138,67.278000000000006,94.848600000000005,150.72420000000002,160.90379999999999,175.245,182.41560000000001,189.2088,192.22800000000001,192.22800000000001,208.6704]
[139,66.157200000000003,93.921599999999998,150.22560000000001,160.4562,174.89939999999999,182.13120000000001,188.97540000000001,192.01499999999999,192.01499999999999,208.57980000000001,null,139,67.747200000000007,95.511600000000001,151.81560000000002,162.0462,176.48939999999999,183.72120000000001,190.56540000000001,193.60499999999999,193.60499999999999,210.16980000000001]
[140,66.636600000000001,94.584600000000009,151.28639999999999,161.6088,176.16419999999999,183.447,190.3218,193.40220000000002,193.40220000000002,210.09959999999998,null,140,68.226600000000005,96.174600000000012,152.87639999999999,163.19880000000001,177.7542,185.03700000000001,191.9118,194.99220000000003,194.99220000000003,211.68959999999998]
[141,67.116,95.268000000000001,152.37779999999998,162.77160000000001,177.429,184.7526,191.69880000000001,194.7792,194.7792,211.61939999999998,null,141,68.706000000000003,96.858000000000004,153.96779999999998,164.36160000000001,179.01900000000001,186.3426,193.28880000000001,196.36920000000001,196.36920000000001,213.20939999999999]
[142,67.595399999999998,95.941200000000009,153.4692,163.91399999999999,178.68360000000001,186.0582,193.04519999999999,196.16639999999998,196.16639999999998,213.12899999999999,null,142,69.185400000000001,97.531200000000013,155.0592,165.50399999999999,180.27360000000002,187.6482,194.6352,197.75639999999999,197.75639999999999,214.71899999999999]
[143,68.064599999999999,96.624600000000001,154.55040000000002,165.06660000000002,179.93819999999999,187.374,194.4222,197.54339999999999,197.54339999999999,214.6386,null,143,69.654600000000002,98.214600000000004,156.14040000000003,166.65660000000003,181.5282,188.964,196.01220000000001,199.13339999999999,199.13339999999999,216.2286]
[144,68.543999999999997,97.297799999999995,155.62139999999999,166.2294,181.2132,188.67959999999999,195.76860000000002,198.9306,198.9306,216.1482,null,144,70.134,98.887799999999999,157.2114,167.8194,182.8032,190.2696,197.35860000000002,200.5206,200.5206,217.73820000000001]
[145,69.033600000000007,97.981200000000001,156.70259999999999,167.38200000000001,182.45759999999999,189.99540000000002,197.1456,200.30760000000001,200.30760000000001,217.66800000000001,null,145,70.62360000000001,99.571200000000005,158.29259999999999,168.97200000000001,184.04759999999999,191.58540000000002,198.73560000000001,201.89760000000001,201.89760000000001,219.25800000000001]
[146,69.482399999999998,98.644199999999998,157.79399999999998,168.52439999999999,183.702,191.30100000000002,198.49199999999999,201.69480000000001,201.69480000000001,219.18779999999998,null,146,71.072400000000002,100.2342,159.38399999999999,170.11439999999999,185.292,192.89100000000002,200.08199999999999,203.28480000000002,203.28480000000002,220.77779999999998]
[147,69.971999999999994,99.317400000000006,158.87519999999998,169.69740000000002,184.96680000000001,192.60660000000001,199.83839999999998,203.0718,203.0718,220.68720000000002,null,147,71.561999999999998,100.90740000000001,160.46519999999998,171.28740000000002,186.55680000000001,194.19660000000002,201.42839999999998,204.6618,204.6618,222.27720000000002]
[148,70.451399999999992,100.00080000000001,159.9462,170.85,186.23160000000001,193.92240000000001,201.21540000000002,204.45899999999997,204.45899999999997,222.20699999999999,null,148,72.041399999999996,101.59080000000002,161.53620000000001,172.44,187.82160000000002,195.51240000000001,202.80540000000002,206.04899999999998,206.04899999999998,223.797]
[149,70.920600000000007,100.67400000000001,161.0274,171.9924,187.4862,195.22800000000001,202.56180000000001,205.81559999999999,205.81559999999999,223.7166,null,149,72.510600000000011,102.26400000000001,162.6174,173.58240000000001,189.0762,196.81800000000001,204.15180000000001,207.40559999999999,207.40559999999999,225.3066]
[150,71.400000000000006,101.3472,162.11879999999999,173.15519999999998,188.74079999999998,196.53360000000001,203.92860000000002,207.2028,207.2028,225.2364,null,150,72.990000000000009,102.9372,163.7088,174.74519999999998,190.33079999999998,198.12360000000001,205.51860000000002,208.7928,208.7928,226.82640000000001]

{"sheet":"ND Svr Multi","index":7,"n_rows":156,"n_cols":17,"rows_kept":156,"cut":false,"hidden":true,"merged":[[0,6,0,7],[0,13,0,15]]}
["UPS Next Day Saver Service",null,null,null,null,null,null,null,null,"UPS Next Day Saver Service",null,null,null,"Residential Surcharge",null,null,1.59]
["- Commercial",null,null,null,null,null,null,null,null,"- Residential"]
["(Per Package Rates from 48 State Origin)",null,null,null,null,null,null,null,null,"(Per Package Rates from 48 State Origin)"]
["Rates below do not include Residential Surcharge",null,null,null,null,null,null,null,null,"Rates Include Residential Surcharge"]
["Lbs.",2,3,4,5,6,7,8,null,"Lbs.",2,3,4,5,6,7,8]
[0.5,5.8140000000000001,5.8140000000000001,6.7932000000000006,7.3133999999999997,7.3746,8.1294000000000004,8.2620000000000005,null,0.5,7.4039999999999999,7.4039999999999999,8.3832000000000004,8.9033999999999995,8.9646000000000008,9.7194000000000003,9.8520000000000003]
[1,5.7834000000000003,5.8650000000000002,7.2930000000000001,7.7316000000000003,7.7825999999999995,8.2721999999999998,8.710799999999999,null,1,7.3734000000000002,7.4550000000000001,8.8830000000000009,9.3216000000000001,9.3726000000000003,9.8621999999999996,10.300799999999999]
[2,5.8650000000000002,6.6606000000000005,8.5373999999999999,9.4553999999999991,10.2714,10.954800000000001,11.250599999999999,null,2,7.4550000000000001,8.2506000000000004,10.1274,11.045399999999999,11.8614,12.5448,12.840599999999998]
[3,5.8650000000000002,7.0482000000000005,9.6288,10.465199999999999,11.597399999999999,12.0564,12.5664,null,3,7.4550000000000001,8.6382000000000012,11.2188,12.055199999999999,13.187399999999998,13.6464,14.1564]
[4,5.8650000000000002,7.4664000000000001,10.6488,11.597399999999999,12.8622,13.26,13.718999999999999,null,4,7.4550000000000001,9.0564,12.238799999999999,13.187399999999998,14.452199999999999,14.85,15.308999999999999]
[5,6.069,7.9458000000000002,11.5566,12.709200000000001,14.0352,14.433,15.004200000000001,null,5,7.6589999999999998,9.5358000000000001,13.146599999999999,14.299200000000001,15.6252,16.023,16.594200000000001]
[6,6.2423999999999999,8.0682000000000009,12.627600000000001,13.810799999999999,14.983799999999999,15.3918,15.932399999999999,null,6,7.8323999999999998,9.6582000000000008,14.217600000000001,15.400799999999998,16.573799999999999,16.9818,17.522400000000001]
[7,6.5994000000000002,9.0678000000000001,13.6578,14.7186,16.2486,16.4832,17.187000000000001,null,7,8.1894000000000009,10.6578,15.2478,16.308600000000002,17.8386,18.0732,18.777000000000001]
[8,6.7319999999999993,9.4655999999999985,14.6166,15.9834,17.3706,17.727599999999999,18.349799999999998,null,8,8.3219999999999992,11.055599999999998,16.206600000000002,17.573399999999999,18.960599999999999,19.317599999999999,19.939799999999998]
[9,7.0788000000000002,9.7410000000000014,15.565199999999999,17.023800000000001,18.543600000000001,18.982199999999999,19.532999999999998,null,9,8.6688000000000009,11.331000000000001,17.155200000000001,18.613800000000001,20.133600000000001,20.572199999999999,21.122999999999998]
[10,7.4561999999999999,10.1592,16.442399999999999,18.1356,19.696199999999997,20.226599999999998,20.7774,null,10,9.0462000000000007,11.7492,18.032399999999999,19.7256,21.286199999999997,21.816599999999998,22.3674]
[11,7.6091999999999995,10.5672,17.2074,19.084199999999999,20.858999999999998,21.3996,22.021799999999999,null,11,9.1991999999999994,12.1572,18.7974,20.674199999999999,22.448999999999998,22.989599999999999,23.611799999999999]
[12,7.8743999999999996,11.026200000000001,18.094799999999999,20.134799999999998,22.021799999999999,22.654199999999999,23.204999999999998,null,12,9.4643999999999995,12.616200000000001,19.684799999999999,21.724799999999998,23.611799999999999,24.244199999999999,24.794999999999998]
[13,8.1395999999999997,11.577,19.084199999999999,21.052800000000001,23.0928,23.898599999999998,24.449399999999997,null,13,9.7295999999999996,13.167,20.674199999999999,22.642800000000001,24.6828,25.488599999999998,26.039399999999997]
[14,8.2517999999999994,12.1686,19.971599999999999,22.011599999999998,24.041399999999999,25.153200000000002,25.642800000000001,null,14,9.8417999999999992,13.758599999999999,21.561599999999999,23.601599999999998,25.631399999999999,26.743200000000002,27.232800000000001]
[15,8.547600000000001,12.627600000000001,21.012,22.95,24.959399999999999,26.254799999999999,26.897400000000001,null,15,10.137600000000001,14.217600000000001,22.602,24.54,26.549399999999999,27.844799999999999,28.487400000000001]
[16,8.8842000000000017,13.0764,21.7362,23.857800000000001,25.887599999999999,27.101400000000002,27.917400000000001,null,16,10.474200000000002,14.666399999999999,23.3262,25.447800000000001,27.477599999999999,28.691400000000002,29.507400000000001]
[17,9.0576000000000008,13.372199999999999,22.776599999999998,24.755399999999998,26.744399999999999,27.825600000000001,28.611000000000001,null,17,10.647600000000001,14.962199999999999,24.366599999999998,26.345399999999998,28.334399999999999,29.415600000000001,30.201000000000001]
[18,9.5267999999999997,13.616999999999999,23.429399999999998,25.5306,27.376799999999999,28.447800000000001,29.2332,null,18,11.1168,15.206999999999999,25.019399999999997,27.1206,28.966799999999999,30.037800000000001,30.8232]
[19,9.8123999999999985,13.973999999999998,24.133199999999999,26.071199999999997,27.968400000000003,29.07,30.018599999999999,null,19,11.402399999999998,15.563999999999998,25.723199999999999,27.661199999999997,29.558400000000002,30.66,31.608599999999999]
[20,10.067399999999999,14.361599999999999,24.694200000000002,26.611799999999999,28.6008,29.712599999999998,30.793800000000001,null,20,11.657399999999999,15.951599999999999,26.284200000000002,28.201799999999999,30.190799999999999,31.302599999999998,32.383800000000001]
[21,10.261200000000001,14.7798,26.611799999999999,28.9374,30.957000000000001,32.262599999999999,33.425400000000003,null,21,11.8512,16.369800000000001,28.201799999999999,30.5274,32.547000000000004,33.852600000000002,35.015400000000007]
[22,10.526400000000001,15.0654,27.336000000000002,29.641199999999998,31.875,33.180599999999998,34.333199999999998,null,22,12.116400000000001,16.6554,28.926000000000002,31.231199999999998,33.465000000000003,34.770600000000002,35.923200000000001]
[23,10.9038,15.401999999999999,28.019399999999997,30.3246,32.6706,34.078199999999995,35.077800000000003,null,23,12.4938,16.992000000000001,29.609399999999997,31.9146,34.260600000000004,35.668199999999999,36.667800000000007]
[24,11.067,15.677399999999999,28.794599999999999,31.058999999999997,33.425400000000003,34.802399999999999,35.893799999999999,null,24,12.657,17.267399999999999,30.384599999999999,32.649000000000001,35.015400000000007,36.392400000000002,37.483800000000002]
[25,11.3628,15.932399999999999,29.5596,31.854600000000001,34.312800000000003,35.577600000000004,36.638400000000004,null,25,12.9528,17.522400000000001,31.1496,33.444600000000001,35.902800000000006,37.167600000000007,38.228400000000008]
[26,11.628,16.279199999999999,30.344999999999999,32.884799999999998,35.220600000000005,36.822000000000003,37.535999999999994,null,26,13.218,17.869199999999999,31.934999999999999,34.474800000000002,36.810600000000008,38.412000000000006,39.125999999999998]
[27,11.883000000000001,16.738199999999999,31.222200000000001,33.659999999999997,36.046800000000005,37.587000000000003,38.352000000000004,null,27,13.473000000000001,18.328199999999999,32.812200000000004,35.25,37.636800000000008,39.177000000000007,39.942000000000007]
[28,12.066599999999999,17.197199999999999,32.017800000000001,34.404599999999995,36.730199999999996,38.525400000000005,39.3414,null,28,13.656599999999999,18.787199999999999,33.607800000000005,35.994599999999998,38.3202,40.115400000000008,40.931400000000004]
[29,12.4338,17.646000000000001,32.884799999999998,35.118600000000001,37.637999999999998,39.423000000000002,40.473599999999998,null,29,14.0238,19.236000000000001,34.474800000000002,36.708600000000004,39.228000000000002,41.013000000000005,42.063600000000001]
[30,12.709200000000001,17.962199999999999,33.619199999999999,35.812199999999997,38.352000000000004,40.126800000000003,41.564999999999998,null,30,14.299200000000001,19.552199999999999,35.209200000000003,37.402200000000001,39.942000000000007,41.716800000000006,43.155000000000001]
[31,12.892800000000001,18.176400000000001,34.496400000000001,36.617999999999995,39.249599999999994,40.850999999999999,42.370800000000003,null,31,14.482800000000001,19.766400000000001,36.086400000000005,38.207999999999998,40.839599999999997,42.441000000000003,43.960800000000006]
[32,13.158000000000001,18.370200000000001,35.220600000000005,37.535999999999994,40.126800000000003,41.564999999999998,43.227600000000002,null,32,14.748000000000001,19.9602,36.810600000000008,39.125999999999998,41.716800000000006,43.155000000000001,44.817600000000006]
[33,13.4232,18.676199999999998,35.812199999999997,38.352000000000004,41.044800000000002,42.391200000000005,44.043599999999998,null,33,15.013199999999999,20.266199999999998,37.402200000000001,39.942000000000007,42.634800000000006,43.981200000000008,45.633600000000001]
[34,13.729200000000001,19.073999999999998,36.546599999999998,39.1374,42.0852,43.156200000000005,45.033000000000001,null,34,15.3192,20.663999999999998,38.136600000000001,40.727400000000003,43.675200000000004,44.746200000000009,46.623000000000005]
[35,13.963799999999999,19.4922,37.444200000000002,39.830999999999996,42.982799999999997,44.104800000000004,45.930599999999998,null,35,15.553799999999999,21.0822,39.034200000000006,41.420999999999999,44.572800000000001,45.694800000000008,47.520600000000002]
[36,14.361599999999999,19.869600000000002,38.209200000000003,40.646999999999998,43.809000000000005,45.073799999999999,46.797600000000003,null,36,15.951599999999999,21.459600000000002,39.799200000000006,42.237000000000002,45.399000000000008,46.663800000000002,48.387600000000006]
[37,14.626799999999999,20.308199999999999,39.035400000000003,41.463000000000001,44.696399999999997,45.920400000000001,47.817600000000006,null,37,16.216799999999999,21.898199999999999,40.625400000000006,43.053000000000004,46.2864,47.510400000000004,49.407600000000009]
[38,14.902199999999999,20.573400000000003,40.075800000000001,42.472799999999999,45.594000000000001,46.705799999999996,48.429599999999994,null,38,16.4922,22.163400000000003,41.665800000000004,44.062800000000003,47.184000000000005,48.2958,50.019599999999997]
[39,15.1572,20.991599999999998,40.973400000000005,43.482600000000005,46.512,47.379000000000005,49.255800000000001,null,39,16.747199999999999,22.581599999999998,42.563400000000009,45.072600000000008,48.102000000000004,48.969000000000008,50.845800000000004]
[40,15.5448,21.481199999999998,41.769000000000005,44.3904,47.654399999999995,48.215400000000002,50.163600000000002,null,40,17.134800000000002,23.071199999999997,43.359000000000009,45.980400000000003,49.244399999999999,49.805400000000006,51.753600000000006]
[41,15.81,21.991199999999999,42.534000000000006,45.4206,48.643799999999999,49.255800000000001,51.244800000000005,null,41,17.400000000000002,23.581199999999999,44.124000000000009,47.010600000000004,50.233800000000002,50.845800000000004,52.834800000000008]
[42,16.075199999999999,22.2972,43.35,46.308,49.633199999999995,50.163600000000002,52.346400000000003,null,42,17.665199999999999,23.8872,44.940000000000005,47.898000000000003,51.223199999999999,51.753600000000006,53.936400000000006]
[43,16.3506,22.593,44.104800000000004,47.327999999999996,50.643000000000001,51.152999999999999,53.570400000000006,null,43,17.9406,24.183,45.694800000000008,48.917999999999999,52.233000000000004,52.743000000000002,55.16040000000001]
[44,16.626000000000001,23.0928,44.900400000000005,48.327600000000004,51.571200000000005,52.193400000000004,54.774000000000001,null,44,18.216000000000001,24.6828,46.490400000000008,49.917600000000007,53.161200000000008,53.783400000000007,56.364000000000004]
[45,16.9116,23.490600000000001,45.726599999999998,49.255800000000001,52.693199999999997,53.070599999999999,55.997999999999998,null,45,18.5016,25.0806,47.316600000000001,50.845800000000004,54.283200000000001,54.660600000000002,57.588000000000001]
[46,17.197199999999999,24.000600000000002,46.512,50.163600000000002,53.672399999999996,54.06,57.018000000000001,null,46,18.787199999999999,25.590600000000002,48.102000000000004,51.753600000000006,55.2624,55.650000000000006,58.608000000000004]
[47,17.462400000000002,24.398400000000002,47.379000000000005,50.959200000000003,54.580199999999998,55.110599999999998,57.925800000000002,null,47,19.052400000000002,25.988400000000002,48.969000000000008,52.549200000000006,56.170200000000001,56.700600000000001,59.515800000000006]
[48,17.809200000000001,24.9084,48.327600000000004,51.765000000000001,55.416599999999995,56.212200000000003,58.802999999999997,null,48,19.3992,26.4984,49.917600000000007,53.355000000000004,57.006599999999999,57.802200000000006,60.393000000000001]
[49,18.094799999999999,25.408200000000001,49.174199999999999,52.693199999999997,56.2836,57.099599999999995,59.6496,null,49,19.684799999999999,26.998200000000001,50.764200000000002,54.283200000000001,57.873600000000003,58.689599999999999,61.239600000000003]
[50,18.36,25.8978,49.888199999999998,53.284800000000004,57.1404,58.048199999999994,60.200400000000002,null,50,19.95,27.4878,51.478200000000001,54.874800000000008,58.730400000000003,59.638199999999998,61.790400000000005]
[51,18.706800000000001,26.285399999999999,49.898400000000002,53.305199999999999,57.150600000000004,58.058399999999999,60.230999999999995,null,51,20.296800000000001,27.875399999999999,51.488400000000006,54.895200000000003,58.740600000000008,59.648400000000002,61.820999999999998]
[52,18.9924,26.795400000000001,51.489599999999996,55.1616,58.802999999999997,60.129000000000005,62.576999999999998,null,52,20.5824,28.385400000000001,53.079599999999999,56.751600000000003,60.393000000000001,61.719000000000008,64.167000000000002]
[53,19.3596,27.203400000000002,52.264800000000001,56.212200000000003,59.6496,61.363199999999999,63.770400000000002,null,53,20.9496,28.793400000000002,53.854800000000004,57.802200000000006,61.239600000000003,62.953200000000002,65.360399999999998]
[54,19.737000000000002,27.784799999999997,53.080799999999996,57.191400000000002,60.332999999999998,62.679000000000002,65.086200000000005,null,54,21.327000000000002,29.374799999999997,54.6708,58.781400000000005,61.923000000000002,64.269000000000005,66.676200000000009]
[55,19.9818,28.294799999999999,53.947800000000001,58.354199999999999,61.149000000000001,64.076400000000007,66.279600000000002,null,55,21.5718,29.884799999999998,55.537800000000004,59.944200000000002,62.739000000000004,65.66640000000001,67.869600000000005]
[56,20.359200000000001,28.9068,54.906599999999997,59.139599999999994,62.046599999999998,64.984200000000001,67.462800000000001,null,56,21.949200000000001,30.4968,56.496600000000001,60.729599999999998,63.636600000000001,66.574200000000005,69.052800000000005]
[57,20.726400000000002,29.386199999999999,55.834800000000001,59.771999999999998,62.984999999999999,66.350999999999999,68.625600000000006,null,57,22.316400000000002,30.976199999999999,57.424800000000005,61.362000000000002,64.575000000000003,67.941000000000003,70.215600000000009]
[58,21.185400000000001,30.018599999999999,56.507999999999996,60.904200000000003,64.168199999999999,67.544399999999996,69.5334,null,58,22.775400000000001,31.608599999999999,58.097999999999999,62.494200000000006,65.758200000000002,69.134399999999999,71.123400000000004]
[59,21.644399999999997,30.702000000000002,57.099599999999995,61.730400000000003,65.524799999999999,68.819400000000002,70.828800000000001,null,59,23.234399999999997,32.292000000000002,58.689599999999999,63.320400000000006,67.114800000000002,70.409400000000005,72.418800000000005]
[60,22.021799999999999,31.487400000000001,58.007399999999997,62.495400000000004,66.779399999999995,69.951599999999999,72.012,null,60,23.611799999999999,33.077400000000004,59.5974,64.085400000000007,68.369399999999999,71.541600000000003,73.602000000000004]
[61,22.368600000000001,32.2014,58.935600000000001,63.556200000000004,67.931999999999988,71.236800000000002,73.174799999999991,null,61,23.958600000000001,33.791400000000003,60.525600000000004,65.146200000000007,69.521999999999991,72.826800000000006,74.764799999999994]
[62,22.746000000000002,32.792999999999999,59.8536,64.300799999999995,69.115200000000002,72.430199999999999,74.429400000000001,null,62,24.336000000000002,34.383000000000003,61.443600000000004,65.890799999999999,70.705200000000005,74.020200000000003,76.019400000000005]
[63,23.3886,33.282600000000002,60.781800000000004,65.086200000000005,70.349400000000003,73.491,75.816599999999994,null,63,24.9786,34.872600000000006,62.371800000000007,66.676200000000009,71.939400000000006,75.081000000000003,77.406599999999997]
[64,23.715,33.925199999999997,61.750799999999998,66.096000000000004,71.553000000000011,74.561999999999998,77.183400000000006,null,64,25.305,35.5152,63.340800000000002,67.686000000000007,73.143000000000015,76.152000000000001,78.773400000000009]
[65,24.184200000000001,34.588199999999993,62.679000000000002,67.116,72.777000000000001,75.959400000000002,78.550200000000004,null,65,25.7742,36.178199999999997,64.269000000000005,68.706000000000003,74.367000000000004,77.549400000000006,80.140200000000007]
[66,24.561599999999999,35.200199999999995,63.556200000000004,68.034000000000006,73.847999999999999,77.163000000000011,79.692599999999999,null,66,26.151599999999998,36.790199999999999,65.146200000000007,69.624000000000009,75.438000000000002,78.753000000000014,81.282600000000002]
[67,25.000200000000003,35.220600000000005,63.576599999999999,68.044199999999989,75.102599999999995,78.550200000000004,80.722800000000007,null,67,26.590200000000003,36.810600000000008,65.166600000000003,69.634199999999993,76.692599999999999,80.140200000000007,82.31280000000001]
[68,25.377599999999997,36.617999999999995,65.524799999999999,70.043400000000005,76.2042,79.692599999999999,81.956999999999994,null,68,26.967599999999997,38.207999999999998,67.114800000000002,71.633400000000009,77.794200000000004,81.282600000000002,83.546999999999997]
[69,25.846799999999998,37.291200000000003,66.504000000000005,71.043000000000006,77.377200000000002,80.845200000000006,83.262599999999992,null,69,27.436799999999998,38.881200000000007,68.094000000000008,72.63300000000001,78.967200000000005,82.435200000000009,84.852599999999995]
[70,26.305799999999998,37.9236,67.289400000000001,72.0732,78.723600000000005,81.956999999999994,84.547799999999995,null,70,27.895799999999998,39.513600000000004,68.879400000000004,73.663200000000003,80.313600000000008,83.546999999999997,86.137799999999999]
[71,26.836199999999998,38.678400000000003,68.329799999999992,73.164600000000007,80.039400000000001,83.038200000000003,85.975800000000007,null,71,28.426199999999998,40.268400000000007,69.919799999999995,74.754600000000011,81.629400000000004,84.628200000000007,87.56580000000001]
[72,27.356400000000001,39.3108,68.900999999999996,74.082599999999999,80.508600000000001,83.874600000000001,87.199799999999996,null,72,28.946400000000001,40.900800000000004,70.491,75.672600000000003,82.098600000000005,85.464600000000004,88.7898]
[73,27.917400000000001,39.922800000000002,69.8292,75.102599999999995,81.671399999999991,85.271999999999991,88.69919999999999,null,73,29.507400000000001,41.512800000000006,71.419200000000004,76.692599999999999,83.261399999999995,86.861999999999995,90.289199999999994]
[74,28.294799999999999,40.810199999999995,70.930800000000005,76.2042,82.77300000000001,86.618400000000008,90.331199999999995,null,74,29.884799999999998,42.400199999999998,72.520800000000008,77.794200000000004,84.363000000000014,88.208400000000012,91.921199999999999]
[75,28.855799999999999,41.534399999999998,71.859000000000009,77.377200000000002,84.078600000000009,87.781199999999998,91.932599999999994,null,75,30.445799999999998,43.124400000000001,73.449000000000012,78.967200000000005,85.668600000000012,89.371200000000002,93.522599999999997]
[76,29.2944,42.095400000000005,72.674999999999997,78.550200000000004,84.710999999999999,89.219399999999993,92.881200000000007,null,76,30.884399999999999,43.685400000000008,74.265000000000001,80.140200000000007,86.301000000000002,90.809399999999997,94.47120000000001]
[77,29.743200000000002,42.1158,73.684799999999996,79.692599999999999,86.37360000000001,90.545400000000001,94.584600000000009,null,77,31.333200000000001,43.705800000000004,75.274799999999999,81.282600000000002,87.963600000000014,92.135400000000004,96.174600000000012]
[78,30.304200000000002,43.441800000000001,74.561999999999998,80.96759999999999,87.495599999999996,91.932599999999994,96.196200000000005,null,78,31.894200000000001,45.031800000000004,76.152000000000001,82.557599999999994,89.085599999999999,93.522599999999997,97.786200000000008]
[79,30.742799999999999,44.135400000000004,75.592200000000005,82.120200000000011,88.597200000000001,93.1464,97.930199999999999,null,79,32.332799999999999,45.725400000000008,77.182200000000009,83.710200000000015,90.187200000000004,94.736400000000003,99.520200000000003]
[80,31.120200000000001,44.941200000000002,76.459199999999996,83.374799999999993,89.749799999999993,94.451999999999998,99.358199999999997,null,80,32.7102,46.531200000000005,78.049199999999999,84.964799999999997,91.339799999999997,96.042000000000002,100.9482]
[81,31.191599999999998,45.655200000000001,77.071200000000005,84.547799999999995,90.198600000000013,95.8596,100.2456,null,81,32.781599999999997,47.245200000000004,78.661200000000008,86.137799999999999,91.788600000000017,97.449600000000004,101.8356]
[82,32.1096,46.471200000000003,77.999399999999994,85.588200000000001,91.646999999999991,97.103999999999999,101.8368,null,82,33.699600000000004,48.061200000000007,79.589399999999998,87.178200000000004,93.236999999999995,98.694000000000003,103.4268]
[83,32.844000000000001,47.185199999999995,79.651800000000009,86.812200000000004,92.3202,98.50139999999999,103.122,null,83,34.434000000000005,48.775199999999998,81.241800000000012,88.402200000000008,93.910200000000003,100.09139999999999,104.712]
[84,33.313199999999995,47.9604,80.722800000000007,87.730200000000011,94.054199999999994,99.909000000000006,104.4684,null,84,34.903199999999998,49.550400000000003,82.31280000000001,89.320200000000014,95.644199999999998,101.49900000000001,106.05840000000001]
[85,33.659999999999997,48.694800000000001,81.610200000000006,88.811399999999992,94.064399999999992,101.33699999999999,105.63120000000001,null,85,35.25,50.284800000000004,83.200200000000009,90.401399999999995,95.654399999999995,102.92699999999999,107.22120000000001]
[86,33.833400000000005,49.480199999999996,82.926000000000002,89.831399999999988,96.298199999999994,102.6528,106.9164,null,86,35.423400000000008,51.0702,84.516000000000005,91.421399999999991,97.888199999999998,104.2428,108.5064]
[87,34.547399999999996,50.2044,84.670200000000008,91.034999999999997,96.328800000000001,103.9278,108.2016,null,87,36.1374,51.794400000000003,86.260200000000012,92.625,97.918800000000005,105.51780000000001,109.7916]
[88,34.965600000000002,51.0306,85.975800000000007,92.269199999999998,96.328800000000001,105.38639999999999,109.395,null,88,36.555600000000005,52.620600000000003,87.56580000000001,93.859200000000001,97.918800000000005,106.9764,110.985]
[89,35.302199999999999,51.815999999999995,86.822400000000002,93.258600000000001,99.133799999999994,106.5594,110.64960000000001,null,89,36.892200000000003,53.405999999999999,88.412400000000005,94.848600000000005,100.7238,108.1494,112.23960000000001]
[90,35.863199999999999,52.611599999999996,88.597200000000001,94.237800000000007,100.929,107.7426,112.01639999999999,null,90,37.453200000000002,54.201599999999999,90.187200000000004,95.827800000000011,102.51900000000001,109.3326,113.60639999999999]
[91,35.863199999999999,53.325600000000001,90.015000000000001,95.278199999999998,102.0408,108.92580000000001,113.18939999999999,null,91,37.453200000000002,54.915600000000005,91.605000000000004,96.868200000000002,103.63080000000001,110.51580000000001,114.7794]
[92,36.587399999999995,54.121200000000002,91.249199999999988,96.481800000000007,103.15259999999999,110.18039999999999,114.444,null,92,38.177399999999999,55.711200000000005,92.839199999999991,98.07180000000001,104.7426,111.7704,116.03400000000001]
[93,37.138199999999998,54.753599999999999,92.442599999999999,97.8078,104.3766,111.384,115.7394,null,93,38.728200000000001,56.343600000000002,94.032600000000002,99.397800000000004,105.9666,112.974,117.32940000000001]
[94,37.587000000000003,55.3962,93.544199999999989,99.001199999999997,105.57,112.53659999999999,117.01439999999999,null,94,39.177000000000007,56.986200000000004,95.134199999999993,100.5912,107.16,114.1266,118.6044]
[95,37.587000000000003,55.9878,94.686599999999999,100.113,106.69199999999999,113.84220000000001,118.20780000000001,null,95,39.177000000000007,57.577800000000003,96.276600000000002,101.703,108.282,115.43220000000001,119.79780000000001]
[96,37.607399999999998,56.630400000000002,95.563800000000001,101.22479999999999,107.8956,114.93360000000001,119.544,null,96,39.197400000000002,58.220400000000005,97.153800000000004,102.81479999999999,109.48560000000001,116.52360000000002,121.134]
[97,39.147600000000004,57.252600000000001,96.614400000000003,102.32639999999999,109.0992,116.2086,120.73740000000001,null,97,40.737600000000008,58.842600000000004,98.204400000000007,103.9164,110.6892,117.79860000000001,122.32740000000001]
[98,39.453600000000002,57.884999999999998,97.583399999999997,103.56060000000001,110.2008,117.4734,122.0022,null,98,41.043600000000005,59.475000000000001,99.173400000000001,105.15060000000001,111.7908,119.0634,123.59220000000001]
[99,39.463799999999999,58.497,98.603400000000008,103.581,111.435,118.6464,123.29759999999999,null,99,41.053800000000003,60.087000000000003,100.19340000000001,105.17100000000001,113.02500000000001,120.2364,124.88759999999999]
[100,39.474000000000004,59.0274,99.429600000000008,105.774,112.53659999999999,119.901,124.58280000000001,null,100,41.064000000000007,60.617400000000004,101.01960000000001,107.364,114.1266,121.491,126.17280000000001]
[101,39.494399999999999,59.0886,100.0722,106.6104,112.88339999999999,120.4722,124.899,null,101,41.084400000000002,60.678600000000003,101.6622,108.2004,114.4734,122.0622,126.489]
[102,39.882000000000005,59.690400000000004,101.08199999999999,107.6712,114.00539999999999,121.6554,126.1434,null,102,41.472000000000008,61.280400000000007,102.672,109.2612,115.5954,123.2454,127.7334]
[103,40.279800000000002,60.271800000000006,102.08159999999999,108.7422,115.1478,122.85900000000001,127.40819999999999,null,103,41.869800000000005,61.861800000000009,103.6716,110.3322,116.73780000000001,124.44900000000001,128.9982]
[104,40.667400000000001,60.863399999999999,103.0812,109.80300000000001,116.26979999999999,124.0728,128.64240000000001,null,104,42.257400000000004,62.453400000000002,104.6712,111.39300000000001,117.85979999999999,125.6628,130.23240000000001]
[105,41.075400000000002,61.465199999999996,104.08080000000001,110.87400000000001,117.3918,125.2764,129.89699999999999,null,105,42.665400000000005,63.055199999999999,105.67080000000001,112.46400000000001,118.98180000000001,126.8664,131.48699999999999]
[106,41.452800000000003,62.056800000000003,105.09059999999999,111.9552,118.5444,126.48,131.1414,null,106,43.042800000000007,63.646800000000006,106.6806,113.54520000000001,120.1344,128.07,132.73140000000001]
[107,41.860799999999998,62.648400000000002,106.08,113.01599999999999,119.6562,127.68360000000001,132.39600000000002,null,107,43.450800000000001,64.238399999999999,107.67,114.60599999999999,121.2462,129.27360000000002,133.98600000000002]
[108,42.248400000000004,63.229800000000004,107.0898,114.0564,120.7782,128.88720000000001,133.6404,null,108,43.838400000000007,64.819800000000001,108.6798,115.6464,122.3682,130.47720000000001,135.2304]
[109,42.656399999999998,63.821399999999997,108.0894,115.1478,121.90020000000001,130.101,134.88480000000001,null,109,44.246400000000001,65.4114,109.6794,116.73780000000001,123.49020000000002,131.691,136.47480000000002]
[110,43.044000000000004,64.412999999999997,109.089,116.2086,123.04259999999999,131.30459999999999,136.14959999999999,null,110,44.634000000000007,66.003,110.679,117.79860000000001,124.6326,132.8946,137.7396]
[111,43.441800000000001,65.004599999999996,110.0784,117.2694,124.16460000000001,132.50819999999999,137.4042,null,111,45.031800000000004,66.5946,111.66840000000001,118.85940000000001,125.75460000000001,134.09819999999999,138.99420000000001]
[112,43.839599999999997,65.585999999999999,111.0882,118.3404,125.2968,133.70160000000001,138.63839999999999,null,112,45.429600000000001,67.176000000000002,112.6782,119.93040000000001,126.88680000000001,135.29160000000002,140.22839999999999]
[113,44.216999999999999,66.177599999999998,112.07759999999999,119.4012,126.429,134.90519999999998,139.88279999999997,null,113,45.807000000000002,67.767600000000002,113.66759999999999,120.99120000000001,128.01900000000001,136.49519999999998,141.47279999999998]
[114,44.625,66.769199999999998,113.0874,120.4722,127.551,136.119,141.13740000000001,null,114,46.215000000000003,68.359200000000001,114.67740000000001,122.0622,129.14099999999999,137.709,142.72740000000002]
[115,45.012600000000006,67.3506,114.08699999999999,121.5432,128.6934,137.32259999999999,142.392,null,115,46.60260000000001,68.940600000000003,115.67699999999999,123.1332,130.2834,138.9126,143.982]
[116,45.4206,67.972800000000007,115.0866,122.604,129.81539999999998,138.52619999999999,143.64660000000001,null,116,47.010600000000004,69.56280000000001,116.67660000000001,124.194,131.40539999999999,140.11619999999999,145.23660000000001]
[117,45.798000000000002,68.554199999999994,116.08620000000001,123.6648,130.9374,139.72980000000001,144.8706,null,117,47.388000000000005,70.144199999999998,117.67620000000001,125.2548,132.5274,141.31980000000001,146.4606]
[118,46.205999999999996,69.145800000000008,117.096,124.73580000000001,132.07980000000001,140.93339999999998,146.1354,null,118,47.795999999999999,70.735800000000012,118.68600000000001,126.32580000000002,133.66980000000001,142.52339999999998,147.72540000000001]
[119,46.593600000000002,69.737400000000008,118.1058,125.80680000000001,133.20179999999999,142.137,147.37980000000002,null,119,48.183600000000006,71.327400000000011,119.69580000000001,127.39680000000001,134.79179999999999,143.727,148.96980000000002]
[120,46.991399999999999,70.329000000000008,119.09520000000001,126.8676,134.32380000000001,143.34059999999999,148.6344,null,120,48.581400000000002,71.919000000000011,120.68520000000001,128.45759999999999,135.91380000000001,144.9306,150.2244]
[121,47.379000000000005,70.910399999999996,120.09479999999999,127.93860000000001,135.46620000000001,144.54420000000002,149.88899999999998,null,121,48.969000000000008,72.500399999999999,121.6848,129.52860000000001,137.05620000000002,146.13420000000002,151.47899999999998]
[122,47.786999999999999,71.501999999999995,121.09439999999999,128.99940000000001,136.5882,145.74779999999998,151.1232,null,122,49.377000000000002,73.091999999999999,122.6844,130.58940000000001,138.1782,147.33779999999999,152.7132]
[123,48.184800000000003,72.093600000000009,122.09400000000001,130.06020000000001,137.71019999999999,146.95140000000001,152.37779999999998,null,123,49.774800000000006,73.683600000000013,123.68400000000001,131.65020000000001,139.30019999999999,148.54140000000001,153.96779999999998]
[124,48.562199999999997,72.674999999999997,123.09360000000001,131.13120000000001,138.86279999999999,148.155,153.62220000000002,null,124,50.152200000000001,74.265000000000001,124.68360000000001,132.72120000000001,140.4528,149.745,155.21220000000002]
[125,48.970199999999998,73.266599999999997,124.10340000000001,132.19200000000001,139.97459999999998,149.36879999999999,154.887,null,125,50.560200000000002,74.8566,125.69340000000001,133.78200000000001,141.56459999999998,150.9588,156.477]
[126,49.357799999999997,73.858199999999997,125.0826,133.25279999999998,141.09660000000002,150.57240000000002,156.12120000000002,null,126,50.947800000000001,75.4482,126.6726,134.84279999999998,142.68660000000003,152.16240000000002,157.71120000000002]
[127,49.755600000000001,74.449799999999996,126.0924,134.32380000000001,142.22880000000001,151.77600000000001,157.3656,null,127,51.345600000000005,76.0398,127.6824,135.91380000000001,143.81880000000001,153.36600000000001,158.9556]
[128,50.143199999999993,75.051599999999993,127.092,135.38459999999998,143.36100000000002,152.97959999999998,158.62019999999998,null,128,51.733199999999997,76.641599999999997,128.68199999999999,136.97459999999998,144.95100000000002,154.56959999999998,160.21019999999999]
[129,50.551200000000001,75.653400000000005,128.0916,136.4556,144.483,154.1832,159.87480000000002,null,129,52.141200000000005,77.243400000000008,129.6816,138.04560000000001,146.07300000000001,155.7732,161.46480000000003]
[130,50.938800000000001,76.234799999999993,129.10139999999998,137.5266,145.61519999999999,155.38679999999999,161.1294,null,130,52.528800000000004,77.824799999999996,130.69139999999999,139.11660000000001,147.20519999999999,156.9768,162.71940000000001]
[131,51.336599999999997,76.826399999999992,130.101,138.5874,146.7474,156.59040000000002,162.36360000000002,null,131,52.926600000000001,78.416399999999996,131.691,140.17740000000001,148.3374,158.18040000000002,163.95360000000002]
[132,51.724200000000003,77.418000000000006,131.11079999999998,139.6482,147.86939999999998,157.79399999999998,163.6182,null,132,53.314200000000007,79.00800000000001,132.70079999999999,141.23820000000001,149.45939999999999,159.38399999999999,165.20820000000001]
[133,52.132199999999997,77.999399999999994,132.1002,140.7192,149.00160000000002,158.99760000000001,164.86259999999999,null,133,53.722200000000001,79.589399999999998,133.6902,142.3092,150.59160000000003,160.58760000000001,166.45259999999999]
[134,52.519800000000004,78.590999999999994,133.11000000000001,141.7902,150.13380000000001,160.2012,166.11720000000003,null,134,54.109800000000007,80.180999999999997,134.70000000000002,143.3802,151.72380000000001,161.7912,167.70720000000003]
[135,52.9176,79.182599999999994,134.0994,142.851,151.25579999999999,161.41499999999999,167.36160000000001,null,135,54.507600000000004,80.772599999999997,135.68940000000001,144.441,152.8458,163.005,168.95160000000001]
[136,53.315400000000004,79.774199999999993,135.10920000000002,143.93220000000002,152.38800000000001,162.62879999999998,168.61619999999999,null,136,54.905400000000007,81.364199999999997,136.69920000000002,145.52220000000003,153.97800000000001,164.21879999999999,170.2062]
[137,53.702999999999996,80.355599999999995,136.1088,144.9828,153.52019999999999,163.82220000000001,169.8708,null,137,55.292999999999999,81.945599999999999,137.69880000000001,146.5728,155.11019999999999,165.41220000000001,171.46080000000001]
[138,54.1008,80.947199999999995,137.10839999999999,146.0538,154.6422,165.036,171.10499999999999,null,138,55.690800000000003,82.537199999999999,138.69839999999999,147.6438,156.23220000000001,166.626,172.69499999999999]
[139,54.488399999999999,81.549000000000007,138.09779999999998,147.13499999999999,155.77439999999999,166.2192,172.3494,null,139,56.078400000000002,83.13900000000001,139.68779999999998,148.72499999999999,157.36439999999999,167.8092,173.93940000000001]
[140,54.8964,82.140600000000006,139.10759999999999,148.18559999999999,156.90660000000003,167.45339999999999,173.61420000000001,null,140,56.486400000000003,83.73060000000001,140.69759999999999,149.7756,158.49660000000003,169.04339999999999,175.20420000000001]
[141,55.284000000000006,82.732200000000006,140.09699999999998,149.2362,158.02860000000001,168.63660000000002,174.8586,null,141,56.874000000000009,84.322200000000009,141.68699999999998,150.8262,159.61860000000001,170.22660000000002,176.4486]
[142,55.681800000000003,83.323799999999991,141.10679999999999,150.31739999999999,159.17100000000002,169.85040000000001,176.11320000000001,null,142,57.271800000000006,84.913799999999995,142.6968,151.9074,160.76100000000002,171.44040000000001,177.70320000000001]
[143,56.069400000000002,83.915399999999991,142.10639999999998,151.38839999999999,160.28279999999998,171.0438,177.36779999999999,null,143,57.659400000000005,85.505399999999995,143.69639999999998,152.97839999999999,161.87279999999998,172.63380000000001,178.95779999999999]
[144,56.477399999999996,84.506999999999991,143.10600000000002,152.44920000000002,161.41499999999999,172.2576,178.602,null,144,58.067399999999999,86.096999999999994,144.69600000000003,154.03920000000002,163.005,173.8476,180.19200000000001]
[145,56.854800000000004,85.098600000000005,144.10560000000001,153.52019999999999,162.5472,173.45100000000002,179.85660000000001,null,145,58.444800000000008,86.688600000000008,145.69560000000001,155.11019999999999,164.13720000000001,175.04100000000003,181.44660000000002]
[146,57.262799999999999,85.68,145.11540000000002,154.58100000000002,163.67939999999999,174.67500000000001,181.101,null,146,58.852800000000002,87.27000000000001,146.70540000000003,156.17100000000002,165.26939999999999,176.26500000000001,182.691]
[147,57.650400000000005,86.271599999999992,146.12519999999998,155.64179999999999,164.8014,175.86839999999998,182.36579999999998,null,147,59.240400000000008,87.861599999999996,147.71519999999998,157.23179999999999,166.3914,177.45839999999998,183.95579999999998]
[148,58.048199999999994,86.863199999999992,147.1146,156.72300000000001,165.93360000000001,177.0822,183.5898,null,148,59.638199999999998,88.453199999999995,148.7046,158.31300000000002,167.52360000000002,178.6722,185.1798]
[149,58.445999999999998,87.454799999999992,148.11420000000001,157.78379999999999,167.0658,178.2654,184.84440000000001,null,149,60.036000000000001,89.044799999999995,149.70420000000001,159.37379999999999,168.6558,179.8554,186.43440000000001]
[150,57.8176133691275,86.487017610738206,146.613607946309,156.21242953020101,165.61032800000001,176.81588096644299,183.48223038926201,null,150,60.4236,89.646600000000007,150.7038,160.43459999999999,169.77779999999998,181.06920000000002,187.6788]

{"sheet":"2DA Multi","index":8,"n_rows":156,"n_cols":23,"rows_kept":156,"cut":false,"hidden":true,"merged":[[0,8,0,9],[0,20,0,21],[1,17,1,19]]}
["UPS Second Day Air Service",null,null,null,null,null,null,null,null,null,null,null,"UPS Second Day Air Service"]
["- Commercial",null,null,null,null,null,null,null,null,null,null,null,"- Residential",null,null,null,null,"Residential Surcharge",null,null,1.59]
["(Per Package Rates from 48 State Origin)",null,null,null,null,null,null,null,null,null,null,null,"(Per Package Rates from 48 State Origin)"]
["Rates below do not include Residential Surcharge",null,null,null,null,null,null,null,null,null,null,null,"Rates Include Residential Surcharge"]
["Lbs.",2,3,4,5,6,7,8,"Zone 224","Zone 225","Zone 226",null,"Lbs.",2,3,4,5,6,7,8,"Zone 224","Zone 225","Zone 226"]
[0.5,4.7940000000000005,4.7940000000000005,4.7940000000000005,4.7940000000000005,5.8343999999999996,6.0792000000000002,6.1301999999999994,9.8634000000000004,9.8634000000000004,10.975199999999999,null,0.5,6.3840000000000003,6.3840000000000003,6.3840000000000003,6.3840000000000003,7.4243999999999994,7.6692,7.7201999999999993,7.9955999999999996,8.2677214285714307,8.53984285714286]
[1,4.8449999999999998,4.8449999999999998,4.8449999999999998,4.8449999999999998,5.7630000000000008,6.0282,6.12,9.4451999999999998,9.4451999999999998,10.087800000000001,null,1,6.4349999999999996,6.4349999999999996,6.4349999999999996,6.4349999999999996,7.3530000000000006,7.6181999999999999,7.71,7.9329428571428604,8.1868499999999997,8.4407571428571497]
[2,4.8449999999999998,4.8449999999999998,4.8449999999999998,5.1101999999999999,6.3647999999999998,6.9257999999999997,7.2216000000000005,10.546799999999999,10.546799999999999,12.4848,null,2,6.4349999999999996,6.4349999999999996,6.4349999999999996,6.7001999999999997,7.9547999999999996,8.5158000000000005,8.8116000000000003,9.1569428571428606,9.6144857142857205,10.0720285714286]
[3,4.8449999999999998,4.8449999999999998,4.8449999999999998,5.5998000000000001,7.3133999999999997,8.0375999999999994,8.2926000000000002,12.036000000000001,12.036000000000001,13.0458,null,3,6.4349999999999996,6.4349999999999996,6.4349999999999996,7.1898,8.9033999999999995,9.6275999999999993,9.8826000000000001,10.586399999999999,11.2719857142857,11.9575714285714]
[4,4.8449999999999998,4.8449999999999998,4.9061999999999992,6.5280000000000005,8.4455999999999989,9.1596000000000011,9.4553999999999991,12.841799999999999,12.841799999999999,13.7088,null,4,6.4349999999999996,6.4349999999999996,6.4961999999999991,8.1180000000000003,10.035599999999999,10.749600000000001,11.045399999999999,12.187799999999999,13.116364285714299,14.044928571428599]
[5,4.8449999999999998,4.8449999999999998,5.3550000000000004,7.242,9.4247999999999994,10.179600000000001,10.761000000000001,13.9434,13.9434,14.2698,null,5,6.4349999999999996,6.4349999999999996,6.9450000000000003,8.8320000000000007,11.014799999999999,11.769600000000001,12.351000000000001,13.7527714285714,14.913021428571399,16.073271428571399]
[6,4.8449999999999998,4.8449999999999998,5.8140000000000001,7.8948,10.475399999999999,11.321999999999999,11.770799999999999,14.79,14.79,15.1572,null,6,6.4349999999999996,6.4349999999999996,7.4039999999999999,9.4847999999999999,12.065399999999999,12.911999999999999,13.360799999999999,15.2128285714286,16.584,17.9551714285715]
[7,4.8449999999999998,5.1816000000000004,6.2934000000000001,8.6394000000000002,11.770799999999999,12.5562,12.953999999999999,15.9528,15.9528,15.9222,null,7,6.4349999999999996,6.7716000000000003,7.8834,10.2294,13.360799999999999,14.1462,14.543999999999999,16.846285714285699,18.4374857142857,20.0286857142857]
[8,4.8449999999999998,5.6609999999999996,6.7422000000000004,9.4044000000000008,13.025399999999999,13.831200000000001,14.259600000000001,16.758600000000001,16.758600000000001,16.789200000000001,null,8,6.4349999999999996,7.2509999999999994,8.3322000000000003,10.994400000000001,14.615399999999999,15.421200000000001,15.849600000000001,18.538028571428601,20.354721428571501,22.171414285714299]
[9,5.1101999999999999,5.9058000000000002,7.2725999999999997,10.098000000000001,14.147399999999999,15.1572,15.657,17.952000000000002,17.952000000000002,17.788800000000002,null,9,6.7001999999999997,7.4958,8.8626000000000005,11.688000000000001,15.737399999999999,16.747199999999999,17.247,20.213742857142901,22.2501,24.286457142857198]
[10,5.3346,6.2627999999999995,7.8438000000000008,10.791600000000001,15.106200000000001,16.4832,16.932000000000002,19.4514,19.4514,18.635400000000001,null,10,6.9245999999999999,7.8527999999999993,9.4338000000000015,12.381600000000001,16.696200000000001,18.0732,18.522000000000002,21.7685142857143,24.000492857142898,26.232471428571401]
[11,5.5692000000000004,6.5994000000000002,8.2007999999999992,11.536200000000001,16.330200000000001,17.676599999999997,18.308999999999997,20.6142,20.6142,20.2164,null,11,7.1592000000000002,8.1894000000000009,9.7907999999999991,13.126200000000001,17.920200000000001,19.266599999999997,19.898999999999997,23.407800000000002,25.8543428571429,28.300885714285702]
[12,5.8650000000000002,6.9869999999999992,8.6598000000000006,12.178799999999999,17.5746,18.941400000000002,19.584,21.358800000000002,21.358800000000002,21.093599999999999,null,12,7.4550000000000001,8.577,10.2498,13.768799999999999,19.1646,20.531400000000001,21.173999999999999,24.9858857142857,27.628050000000002,30.2702142857143]
[13,6.2627999999999995,7.3440000000000003,8.9657999999999998,12.9132,18.717000000000002,19.859399999999997,20.706,22.123800000000003,22.123800000000003,21.7056,null,13,7.8527999999999993,8.9340000000000011,10.5558,14.5032,20.307000000000002,21.449399999999997,22.295999999999999,26.287114285714299,29.076814285714299,31.866514285714299]
[14,6.5585999999999993,7.7316000000000003,9.5472000000000001,13.6578,19.859399999999997,20.899799999999999,21.6342,22.9908,22.9908,22.603200000000001,null,14,8.1486000000000001,9.3216000000000001,11.1372,15.2478,21.449399999999997,22.489799999999999,23.2242,27.5562857142857,30.4804071428571,33.4045285714286]
[15,6.8136000000000001,7.9151999999999996,10.016400000000001,14.1882,20.899799999999999,21.838200000000001,22.6236,24.041399999999999,24.041399999999999,23.8782,null,15,8.4036000000000008,9.5052000000000003,11.606400000000001,15.7782,22.489799999999999,23.4282,24.2136,28.797771428571401,31.8748928571428,34.952014285714299]
[16,6.9869999999999992,8.1803999999999988,10.455,14.6472,21.838200000000001,22.939799999999998,23.572199999999999,25.030799999999999,25.030799999999999,24.235200000000003,null,16,8.577,9.7703999999999986,12.045,16.237200000000001,23.4282,24.529799999999998,25.162199999999999,30.058199999999999,33.295971428571399,36.533742857142798]
[17,7.2012,8.4353999999999996,10.893599999999999,15.330599999999999,22.807199999999998,24.163800000000002,24.683999999999997,26.2242,26.2242,25.326599999999999,null,17,8.7911999999999999,10.025399999999999,12.483599999999999,16.9206,24.397199999999998,25.753800000000002,26.273999999999997,31.494942857142899,34.917042857142903,38.339142857142903]
[18,7.4664000000000001,8.710799999999999,11.301600000000001,15.881400000000001,23.7456,25.245000000000001,26.142599999999998,27.784799999999997,27.784799999999997,27.468599999999999,null,18,9.0564,10.300799999999999,12.8916,17.471400000000003,25.335599999999999,26.835000000000001,27.732599999999998,33.023485714285698,36.649949999999997,40.276414285714303]
[19,7.7316000000000003,8.9453999999999994,11.628,16.524000000000001,24.622800000000002,26.417999999999999,26.999399999999998,28.7028,28.7028,27.897000000000002,null,19,9.3216000000000001,10.535399999999999,13.218,18.114000000000001,26.212800000000001,28.007999999999999,28.589399999999998,34.2489428571429,38.025492857142901,41.802042857142901]
[20,8.0172000000000008,9.3330000000000002,12.0768,17.288999999999998,25.479600000000001,27.305399999999999,27.9786,29.712599999999998,29.712599999999998,28.968,null,20,9.6072000000000006,10.923,13.6668,18.878999999999998,27.069600000000001,28.895399999999999,29.5686,35.405914285714303,39.307049999999997,43.208185714285698]
[21,8.3946000000000005,9.7103999999999999,12.535799999999998,17.860200000000003,26.417999999999999,28.223400000000002,29.284200000000002,31.099799999999998,31.099799999999998,30.3858,null,21,9.9846000000000004,11.3004,14.125799999999998,19.450200000000002,28.007999999999999,29.813400000000001,30.874200000000002,36.733371428571402,40.789692857142803,44.846014285714297]
[22,8.6394000000000002,10.1592,12.872399999999999,18.349799999999998,27.264600000000002,29.2944,30.365400000000001,32.252400000000002,32.252400000000002,31.681199999999997,null,22,10.2294,11.7492,14.462399999999999,19.939799999999998,28.854600000000001,30.884399999999999,31.955400000000001,37.987971428571399,42.196564285714302,46.405157142857099]
[23,8.8536000000000001,10.383599999999999,13.321200000000001,18.8904,28.223400000000002,30.263400000000001,31.497599999999998,33.466200000000001,33.466200000000001,32.803199999999997,null,23,10.4436,11.973599999999999,14.911200000000001,20.480399999999999,29.813400000000001,31.853400000000001,33.087600000000002,39.308142857142897,43.686492857142902,48.064842857142899]
[24,9.0371999999999986,10.791600000000001,13.749600000000001,19.614599999999999,29.2638,31.446599999999997,32.619599999999998,34.639200000000002,34.639200000000002,34.047600000000003,null,24,10.627199999999998,12.381600000000001,15.339600000000001,21.204599999999999,30.8538,33.0366,34.209600000000002,40.746342857142899,45.302464285714301,49.858585714285702]
[25,9.3330000000000002,11.0976,14.014800000000001,20.308199999999999,30.212400000000002,32.568599999999996,33.731400000000001,35.863199999999999,35.863199999999999,35.292000000000002,null,25,10.923,12.6876,15.604800000000001,21.898199999999999,31.802400000000002,34.1586,35.321400000000004,42.104399999999998,46.830642857142898,51.556885714285698]
[26,9.6083999999999996,11.3934,14.545199999999999,20.950799999999997,31.252800000000001,33.659999999999997,34.639200000000002,36.811800000000005,36.811800000000005,36.454799999999999,null,26,11.198399999999999,12.9834,16.135200000000001,22.540799999999997,32.842800000000004,35.25,36.229200000000006,43.359000000000002,48.228042857142903,53.097085714285697]
[27,9.9245999999999999,11.719799999999999,14.922600000000001,21.695399999999999,32.313600000000001,34.802399999999999,35.730600000000003,37.9848,37.9848,37.607399999999998,null,27,11.5146,13.309799999999999,16.512600000000003,23.285399999999999,33.903600000000004,36.392400000000002,37.320600000000006,44.744742857142903,49.7795357142857,54.814328571428597]
[28,10.240799999999998,12.127800000000001,15.238799999999999,22.215600000000002,33.109200000000001,35.679599999999994,36.617999999999995,39.208799999999997,39.208799999999997,39.025199999999998,null,28,11.830799999999998,13.7178,16.828800000000001,23.805600000000002,34.699200000000005,37.269599999999997,38.207999999999998,45.780771428571398,50.927399999999999,56.074028571428499]
[29,10.526400000000001,12.3216,15.7182,22.7256,34.017000000000003,36.617999999999995,37.689,40.218600000000002,40.218600000000002,40.1676,null,29,12.116400000000001,13.9116,17.308199999999999,24.3156,35.607000000000006,38.207999999999998,39.279000000000003,47.017885714285697,52.317149999999998,57.616414285714299]
[30,10.71,12.658200000000001,16.2486,23.470200000000002,34.9452,37.576800000000006,38.647800000000004,41.452800000000003,41.452800000000003,41.248799999999996,null,30,12.3,14.248200000000001,17.8386,25.060200000000002,36.535200000000003,39.166800000000009,40.237800000000007,48.247714285714302,53.688685714285697,59.129657142857198]
[31,11.026200000000001,13.086600000000001,16.697400000000002,24.000600000000002,35.730600000000003,38.402999999999999,39.6678,42.482999999999997,42.482999999999997,42.554400000000001,null,31,12.616200000000001,14.676600000000001,18.287400000000002,25.590600000000002,37.320600000000006,39.993000000000002,41.257800000000003,49.333285714285701,54.890099999999997,60.4469142857143]
[32,11.189400000000001,13.372199999999999,17.156400000000001,24.592199999999998,36.770999999999994,39.463799999999999,40.636800000000001,43.8294,43.8294,43.757999999999996,null,32,12.779400000000001,14.962199999999999,18.746400000000001,26.182199999999998,38.360999999999997,41.053800000000003,42.226800000000004,50.635971428571402,56.355257142857099,62.074542857142802]
[33,11.505599999999999,13.7088,17.625600000000002,25.1022,37.770600000000002,40.371600000000001,41.656800000000004,45.022800000000004,45.022800000000004,44.8902,null,33,13.095599999999999,15.2988,19.215600000000002,26.6922,39.360600000000005,41.961600000000004,43.246800000000007,51.8279142857143,57.68235,63.536785714285699]
[34,11.8728,13.984200000000001,18.013200000000001,25.979399999999998,38.912999999999997,41.360999999999997,42.697200000000002,46.195799999999998,46.195799999999998,46.124400000000001,null,34,13.4628,15.574200000000001,19.603200000000001,27.569399999999998,40.503,42.951000000000001,44.287200000000006,53.153914285714301,59.158435714285702,65.162957142857195]
[35,12.107399999999998,14.382,18.411000000000001,26.499600000000001,40.075800000000001,42.4116,43.757999999999996,47.460599999999999,47.460599999999999,47.440199999999997,null,35,13.697399999999998,15.972,20.001000000000001,28.089600000000001,41.665800000000004,44.001600000000003,45.347999999999999,54.493028571428603,60.660021428571497,66.827014285714299]
[36,12.2706,14.7186,18.7578,27.03,41.167200000000001,43.757999999999996,44.8596,48.541800000000002,48.541800000000002,48.511200000000002,null,36,13.8606,16.308600000000002,20.347799999999999,28.62,42.757200000000005,45.347999999999999,46.449600000000004,55.992428571428597,62.358685714285699,68.724942857142906]
[37,12.5154,14.9328,19.216799999999999,27.723600000000001,42.268799999999999,44.910600000000002,46.052999999999997,49.816800000000001,49.816800000000001,49.9392,null,37,14.105399999999999,16.5228,20.806799999999999,29.313600000000001,43.858800000000002,46.500600000000006,47.643000000000001,57.481628571428601,64.039500000000004,70.597371428571506]
[38,12.7296,15.1776,19.7166,28.294799999999999,43.360199999999999,46.083599999999997,47.297399999999996,50.959200000000003,50.959200000000003,51.0306,null,38,14.319599999999999,16.767600000000002,21.3066,29.884799999999998,44.950200000000002,47.6736,48.8874,58.992685714285699,65.748364285714302,72.504042857142807]
[39,13.117199999999999,15.565199999999999,20.042999999999999,28.845600000000001,44.400600000000004,47.297399999999996,48.531599999999997,52.173000000000002,52.173000000000002,52.285199999999996,null,39,14.707199999999998,17.155200000000001,21.632999999999999,30.435600000000001,45.990600000000008,48.8874,50.121600000000001,60.427971428571396,67.358871428571405,74.289771428571399]
[40,13.463999999999999,15.9732,20.502000000000002,29.518800000000002,45.4206,48.4602,49.6128,53.203199999999995,53.203199999999995,53.570400000000006,null,40,15.053999999999998,17.563200000000002,22.092000000000002,31.108800000000002,47.010600000000004,50.050200000000004,51.202800000000003,61.774371428571399,68.857907142857101,75.941442857142803]
[41,13.821000000000002,16.360799999999998,20.7468,30.069600000000001,46.420200000000001,49.704599999999999,50.959200000000003,54.355800000000002,54.355800000000002,54.080400000000004,null,41,15.411000000000001,17.950799999999997,22.3368,31.659600000000001,48.010200000000005,51.294600000000003,52.549200000000006,63.283971428571398,70.561671428571401,77.839371428571397]
[42,14.014800000000001,16.738199999999999,21.164999999999999,30.671400000000002,47.419800000000002,50.959200000000003,52.234200000000001,55.600200000000001,55.600200000000001,55.304400000000001,null,42,15.604800000000001,18.328199999999999,22.754999999999999,32.261400000000002,49.009800000000006,52.549200000000006,53.824200000000005,64.8125142857143,72.289478571428603,79.766442857142906]
[43,14.331000000000001,17.085000000000001,21.5016,31.191599999999998,48.531599999999997,51.897600000000004,53.315400000000004,56.630400000000002,56.630400000000002,56.701800000000006,null,43,15.921000000000001,18.675000000000001,23.0916,32.781599999999997,50.121600000000001,53.487600000000008,54.905400000000007,66.084599999999995,73.713471428571395,81.342342857142896]
[44,14.6166,17.329799999999999,21.960599999999999,31.752599999999997,49.480199999999996,52.784999999999997,54.366,57.752399999999994,57.752399999999994,57.691200000000002,null,44,16.206600000000002,18.919799999999999,23.550599999999999,33.342599999999997,51.0702,54.375,55.956000000000003,67.299857142857107,75.074078571428501,82.848299999999895]
[45,14.922600000000001,17.727599999999999,22.2972,32.2014,50.357399999999998,53.754000000000005,55.171800000000005,58.609200000000001,58.609200000000001,58.833599999999997,null,45,16.512600000000003,19.317599999999999,23.8872,33.791400000000003,51.947400000000002,55.344000000000008,56.761800000000008,68.346085714285707,76.233964285714293,84.121842857142795]
[46,15.085799999999999,17.941800000000001,22.746000000000002,32.680799999999998,51.2346,54.610799999999998,56.507999999999996,60.027000000000001,60.027000000000001,60.057600000000001,null,46,16.675799999999999,19.5318,24.336000000000002,34.270800000000001,52.824600000000004,56.200800000000001,58.097999999999999,69.718714285714299,77.793471428571394,85.868228571428602]
[47,15.412199999999999,18.278400000000001,23.154,33.15,52.234200000000001,55.477800000000002,57.599399999999996,61.169399999999996,61.169399999999996,61.485599999999998,null,47,17.002199999999998,19.868400000000001,24.744,34.74,53.824200000000005,57.067800000000005,59.189399999999999,70.925228571428605,79.140964285714304,87.356700000000004]
[48,15.7182,18.706800000000001,23.562000000000001,33.629399999999997,53.152200000000001,56.426400000000001,58.568400000000004,62.199599999999997,62.199599999999997,62.536200000000001,null,48,17.308199999999999,20.296800000000001,25.152000000000001,35.2194,54.742200000000004,58.016400000000004,60.158400000000007,72.0676285714286,80.409771428571403,88.751914285714307]
[49,16.0242,19.145399999999999,23.9496,34.210799999999999,54.049800000000005,57.232199999999999,59.680199999999999,63.372600000000006,63.372600000000006,62.903400000000005,null,49,17.6142,20.735399999999998,25.5396,35.800800000000002,55.639800000000008,58.822200000000002,61.270200000000003,73.237714285714304,81.710635714285701,90.183557142857197]
[50,16.268999999999998,19.400400000000001,24.327000000000002,34.802399999999999,54.978000000000002,58.109400000000001,60.618600000000001,64.392600000000002,64.392600000000002,62.9238,null,50,17.858999999999998,20.990400000000001,25.917000000000002,36.392400000000002,56.568000000000005,59.699400000000004,62.208600000000004,74.393228571428594,83.004578571428596,91.615928571428597]
[51,16.503599999999999,19.614599999999999,24.734999999999999,35.302199999999999,55.895999999999994,59.180400000000006,61.679400000000001,65.504400000000004,65.504400000000004,64.474199999999996,null,51,18.093599999999999,21.204599999999999,26.324999999999999,36.892200000000003,57.485999999999997,60.770400000000009,63.269400000000005,75.694457142857104,84.473742857142895,93.253028571428501]
[52,16.697400000000002,19.9206,25.193999999999999,36.148799999999994,56.732399999999998,60.261600000000001,62.750400000000006,66.646799999999999,66.646799999999999,66.983400000000003,null,52,18.287400000000002,21.5106,26.783999999999999,37.738799999999998,58.322400000000002,61.851600000000005,64.340400000000002,77.030657142857095,85.972778571428506,94.914900000000003]
[53,17.0136,20.308199999999999,25.540800000000001,36.679200000000002,57.599399999999996,61.332599999999999,63.525600000000004,66.667199999999994,66.667199999999994,67.003799999999998,null,53,18.6036,21.898199999999999,27.130800000000001,38.269200000000005,59.189399999999999,62.922600000000003,65.115600000000001,78.110399999999998,87.1690928571428,96.227785714285702]
[54,17.248200000000001,20.6448,25.928400000000003,37.250400000000006,58.568400000000004,62.525999999999996,64.474199999999996,68.493000000000009,68.493000000000009,67.024199999999993,null,54,18.838200000000001,22.2348,27.518400000000003,38.84040000000001,60.158400000000007,64.116,66.0642,79.407257142857105,88.624414285714195,97.841571428571399]
[55,17.584799999999998,20.981400000000001,26.244600000000002,37.9236,59.598599999999998,63.7194,65.44319999999999,69.492599999999996,69.492599999999996,70.451399999999992,null,55,19.174799999999998,22.571400000000001,27.834600000000002,39.513600000000004,61.188600000000001,65.309399999999997,67.033199999999994,80.718685714285698,90.090299999999999,99.4619142857143]
[56,17.839799999999997,21.267000000000003,26.622,38.535600000000002,60.516599999999997,64.719000000000008,66.616200000000006,70.767600000000002,70.767600000000002,71.0124,null,56,19.429799999999997,22.857000000000003,28.212,40.125600000000006,62.1066,66.309000000000012,68.20620000000001,82.053428571428597,91.593707142857198,101.133985714286]
[57,18.0642,21.6036,27.0504,39.065999999999995,61.5672,65.790000000000006,67.83,72.052800000000005,72.052800000000005,71.022599999999997,null,57,19.654199999999999,23.1936,28.6404,40.655999999999999,63.157200000000003,67.38000000000001,69.42,83.469771428571406,93.190735714285694,102.9117]
[58,18.411000000000001,21.960599999999999,27.54,39.708599999999997,62.750400000000006,66.922200000000004,68.880600000000001,73.134,73.134,72.134399999999999,null,58,20.001000000000001,23.550599999999999,29.13,41.2986,64.340400000000002,68.512200000000007,70.470600000000005,84.835114285714297,94.711628571428605,104.588142857143]
[59,18.635400000000001,22.215600000000002,28.060200000000002,40.4328,63.902999999999999,68.003399999999999,69.992400000000004,74.347800000000007,74.347800000000007,73.031999999999996,null,59,20.2254,23.805600000000002,29.650200000000002,42.022800000000004,65.492999999999995,69.593400000000003,71.582400000000007,86.266028571428606,96.319221428571495,106.372414285714]
[60,18.7986,22.44,28.498800000000003,41.004000000000005,65.035200000000003,69.166200000000003,70.869600000000005,75.245399999999989,75.245399999999989,73.858199999999997,null,60,20.3886,24.03,30.088800000000003,42.594000000000008,66.625200000000007,70.756200000000007,72.459600000000009,87.5920285714286,97.813521428571505,108.035014285714]
[61,19.145399999999999,22.746000000000002,28.886400000000002,41.534399999999998,66.004199999999997,69.951599999999999,72.012,75.408600000000007,75.408600000000007,77.499600000000001,null,61,20.735399999999998,24.336000000000002,30.476400000000002,43.124400000000001,67.594200000000001,71.541600000000003,73.602000000000004,88.791257142857106,99.152999999999906,109.51474285714301]
[62,19.4922,23.1846,29.2332,42.207599999999999,66.922200000000004,71.144999999999996,73.276800000000009,77.825999999999993,77.825999999999993,79.305000000000007,null,62,21.0822,24.7746,30.8232,43.797600000000003,68.512200000000007,72.734999999999999,74.866800000000012,90.2221714285714,100.756585714286,111.291]
[63,19.808400000000002,23.562000000000001,29.6004,42.758400000000002,67.891199999999998,72.318000000000012,74.684399999999997,79.213200000000001,79.213200000000001,79.325400000000002,null,63,21.398400000000002,25.152000000000001,31.1904,44.348400000000005,69.481200000000001,73.908000000000015,76.2744,91.740514285714298,102.470185714286,113.199857142857]
[64,20.165399999999998,23.898599999999998,29.947199999999999,43.35,68.900999999999996,73.491,75.653400000000005,79.23360000000001,79.23360000000001,79.335599999999999,null,64,21.755399999999998,25.488599999999998,31.537199999999999,44.940000000000005,70.491,75.081000000000003,77.243400000000008,93.019885714285707,103.89855,114.777214285714]
[65,20.471399999999999,24.255600000000001,30.406199999999998,43.992600000000003,69.920999999999992,74.704799999999992,76.969200000000001,81.742800000000003,81.742800000000003,80.325000000000003,null,65,22.061399999999999,25.845600000000001,31.996199999999998,45.582600000000006,71.510999999999996,76.294799999999995,78.559200000000004,94.536771428571498,105.604864285714,116.672957142857]
[66,20.726400000000002,24.500399999999999,30.834600000000002,44.706600000000002,71.063400000000001,75.653400000000005,78.335999999999999,82.028400000000005,82.028400000000005,81.905999999999992,null,66,22.316400000000002,26.090399999999999,32.424600000000005,46.296600000000005,72.653400000000005,77.243400000000008,79.926000000000002,96.044914285714299,107.3079,118.570885714285]
[67,20.91,24.9696,31.314,45.430799999999998,71.940600000000003,76.765200000000007,79.468199999999996,84.394799999999989,84.394799999999989,83.1708,null,67,22.5,26.5596,32.904000000000003,47.020800000000001,73.530600000000007,78.355200000000011,81.058199999999999,97.402971428571405,108.82769999999999,120.252428571428]
[68,21.164999999999999,25.193999999999999,31.752599999999997,46.216200000000001,72.909599999999998,77.785200000000003,80.467799999999997,85.465800000000002,85.465800000000002,84.19080000000001,null,68,22.754999999999999,26.783999999999999,33.342599999999997,47.806200000000004,74.499600000000001,79.375200000000007,82.0578,98.695457142857094,110.275735714286,121.856014285714]
[69,21.511800000000001,25.551000000000002,32.150399999999998,47.062800000000003,73.817400000000006,78.846000000000004,81.875399999999999,85.761600000000001,85.761600000000001,84.670200000000008,null,69,23.101800000000001,27.141000000000002,33.740400000000001,48.652800000000006,75.40740000000001,80.436000000000007,83.465400000000002,100.18465714285701,111.947078571429,123.70950000000001]
[70,21.848400000000002,25.948800000000002,32.6706,47.868600000000001,74.704799999999992,79.835399999999993,82.793400000000005,86.7,86.7,85.690200000000004,null,70,23.438400000000001,27.538800000000002,34.260600000000004,49.458600000000004,76.294799999999995,81.425399999999996,84.383400000000009,101.348914285714,113.229,125.109085714285]
[71,22.123800000000003,26.2956,33.109200000000001,48.531599999999997,75.724799999999988,80.753399999999999,83.884799999999998,87.842399999999998,87.842399999999998,87.811800000000005,null,71,23.713800000000003,27.8856,34.699200000000005,50.121600000000001,77.314799999999991,82.343400000000003,85.474800000000002,102.62391428571399,114.652992857143,126.68207142857101]
[72,22.3992,26.774999999999999,33.517200000000003,49.265999999999998,76.765200000000007,81.905999999999992,85.139399999999995,89.158199999999994,89.158199999999994,88.158600000000007,null,72,23.9892,28.364999999999998,35.107200000000006,50.856000000000002,78.355200000000011,83.495999999999995,86.729399999999998,104.0898,116.294464285714,128.499128571429]
[73,22.603200000000001,26.9892,34.017000000000003,50.092199999999998,77.8566,83.028000000000006,86.108400000000003,90.168000000000006,90.168000000000006,89.14800000000001,null,73,24.193200000000001,28.5792,35.607000000000006,51.682200000000002,79.446600000000004,84.618000000000009,87.698400000000007,105.465342857143,117.83794285714301,130.210542857143]
[74,22.9194,27.325799999999997,34.475999999999999,50.7348,78.896999999999991,84.2928,87.414000000000001,92.840400000000002,92.840400000000002,91.667400000000001,null,74,24.509399999999999,28.915799999999997,36.066000000000003,52.324800000000003,80.486999999999995,85.882800000000003,89.004000000000005,107.00408571428601,119.569757142857,132.135428571429]
[75,23.245799999999999,27.7746,34.853400000000001,51.438600000000001,79.968000000000004,85.4148,88.566599999999994,94.023600000000002,94.023600000000002,92.82,null,75,24.835799999999999,29.364599999999999,36.443400000000004,53.028600000000004,81.558000000000007,87.004800000000003,90.156599999999997,108.39274285714301,121.119792857143,133.846842857143]
[76,23.490600000000001,28.0806,35.281800000000004,52.030200000000001,80.426999999999992,86.659199999999998,89.525399999999991,94.880399999999995,94.880399999999995,94.084800000000001,null,76,25.0806,29.6706,36.871800000000007,53.620200000000004,82.016999999999996,88.249200000000002,91.115399999999994,109.575942857143,122.447614285714,135.319285714286]
[77,23.898599999999998,28.447800000000001,35.720400000000005,52.683,82.150800000000004,87.648600000000002,90.6066,94.900800000000004,94.900800000000004,94.125600000000006,null,77,25.488599999999998,30.037800000000001,37.310400000000008,54.273000000000003,83.740800000000007,89.238600000000005,92.196600000000004,111.03454285714299,124.068685714286,137.102828571429]
[78,24.133199999999999,28.682400000000001,36.240600000000001,53.448,82.171199999999999,88.780799999999999,91.340999999999994,95.665800000000004,95.665800000000004,94.666200000000003,null,78,25.723199999999999,30.272400000000001,37.830600000000004,55.038000000000004,83.761200000000002,90.370800000000003,92.930999999999997,111.95399999999999,125.08795714285699,138.22191428571401]
[79,24.398400000000002,29.039400000000001,36.730199999999996,54.233400000000003,84.343800000000002,89.80080000000001,92.881200000000007,97.267200000000003,97.267200000000003,96.236999999999995,null,79,25.988400000000002,30.6294,38.3202,55.823400000000007,85.933800000000005,91.390800000000013,94.47120000000001,113.87742857142899,127.25545714285801,140.633485714286]
[80,24.786000000000001,29.376000000000001,37.250400000000006,54.927,85.4148,90.9024,92.89139999999999,98.460599999999999,98.460599999999999,97.440600000000003,null,80,26.376000000000001,30.966000000000001,38.84040000000001,56.517000000000003,87.004800000000003,92.492400000000004,94.481399999999994,114.601628571429,128.01353571428601,141.425442857143]
[81,25.000200000000003,29.712599999999998,37.270800000000001,54.947399999999995,85.435200000000009,90.922799999999995,92.911799999999999,99.184799999999996,99.184799999999996,97.746600000000001,null,81,26.590200000000003,31.302599999999998,38.860800000000005,56.537399999999998,87.025200000000012,92.512799999999999,94.501800000000003,114.521485714286,127.890042857143,141.2586]
[82,25.285799999999998,30.079799999999999,38.086800000000004,56.334599999999995,87.393600000000006,93.187200000000004,96.247199999999992,100.78620000000001,100.78620000000001,99.858000000000004,null,82,26.875799999999998,31.669799999999999,39.676800000000007,57.924599999999998,88.98360000000001,94.777200000000008,97.837199999999996,118.021542857143,131.89317857142899,145.76481428571401]
[83,25.4694,30.426599999999997,38.586599999999997,56.354999999999997,88.393199999999993,93.544199999999989,97.389600000000002,101.9592,101.9592,101.1534,null,83,27.0594,32.016599999999997,40.176600000000001,57.945,89.983199999999997,95.134199999999993,98.979600000000005,119.01385714285701,133.0068,146.99974285714299]
[84,25.785600000000002,30.834600000000002,38.923199999999994,57.334200000000003,88.413600000000002,95.706599999999995,98.348399999999998,102.97919999999999,102.97919999999999,102.2448,null,84,27.375600000000002,32.424600000000005,40.513199999999998,58.924200000000006,90.003600000000006,97.296599999999998,99.938400000000001,120.48557142857101,134.66138571428499,148.8372]
[85,26.0916,31.242599999999999,39.300600000000003,58.252200000000002,90.361800000000002,96.9816,99.399000000000001,104.09099999999999,104.09099999999999,103.4178,null,85,27.6816,32.832599999999999,40.890600000000006,59.842200000000005,91.951800000000006,98.571600000000004,100.989,122.17440000000001,136.54802142857099,150.92164285714301]
[86,26.4588,31.262999999999998,39.759599999999999,58.925400000000003,90.372,98.236199999999997,100.56180000000001,105.28440000000001,105.28440000000001,104.56020000000001,null,86,28.0488,32.853000000000002,41.349600000000002,60.515400000000007,91.962000000000003,99.8262,102.15180000000001,123.3678,137.89879285714301,152.429785714286]
[87,26.642400000000002,31.885200000000001,40.208400000000005,59.5884,90.392400000000009,98.256599999999992,101.56139999999999,106.33499999999999,106.33499999999999,105.68219999999999,null,87,28.232400000000002,33.475200000000001,41.798400000000008,61.178400000000003,91.982400000000013,99.846599999999995,103.1514,123.90694285714299,138.467078571429,153.027214285714]
[88,26.8872,32.272800000000004,40.687800000000003,60.139200000000002,90.412800000000004,98.277000000000001,101.5818,107.51819999999999,107.51819999999999,106.87560000000001,null,88,28.4772,33.862800000000007,42.277800000000006,61.729200000000006,92.002800000000008,99.867000000000004,103.1718,123.886542857143,138.380014285714,152.87348571428601]
[89,27.172800000000002,32.4666,41.095799999999997,60.7104,90.423000000000002,98.287199999999999,101.592,108.87479999999999,108.87479999999999,108.069,null,89,28.762800000000002,34.056600000000003,42.6858,62.300400000000003,92.013000000000005,99.877200000000002,103.182,123.871971428571,138.30861428571399,152.74525714285701]
[90,27.631799999999998,32.803199999999997,41.483400000000003,61.342800000000004,94.237800000000007,102.92819999999999,105.0702,110.0376,110.0376,109.3338,null,90,29.221799999999998,34.3932,43.073400000000007,62.932800000000007,95.827800000000011,104.51819999999999,106.6602,128.84957142857101,144.03955714285701,159.22954285714201]
[91,28.019399999999997,33.221400000000003,41.503799999999998,62.1282,94.258200000000002,104.21340000000001,106.21259999999999,111.2106,111.2106,110.5782,null,91,29.609399999999997,34.811400000000006,43.093800000000002,63.718200000000003,95.848200000000006,105.80340000000001,107.8026,130.000714285714,145.33349999999999,160.66628571428501]
[92,28.3764,33.558,42.360599999999998,62.148600000000002,94.278600000000012,104.2338,107.28360000000001,112.3428,112.3428,111.7308,null,92,29.9664,35.148000000000003,43.950600000000001,63.738600000000005,95.868600000000015,105.82380000000001,108.87360000000001,130.480114285714,145.83694285714299,161.19377142857101]
[93,28.611000000000001,34.047600000000003,42.370800000000003,62.169000000000004,94.299000000000007,104.2542,107.304,113.4444,113.4444,112.914,null,93,30.201000000000001,35.637600000000006,43.960800000000006,63.759000000000007,95.88900000000001,105.8442,108.89400000000001,130.37228571428599,145.673014285715,160.97374285714301]
[94,28.845600000000001,34.067999999999998,42.850200000000001,62.179200000000002,94.319400000000002,107.44680000000001,108.36479999999999,113.4648,113.4648,112.9242,null,94,30.435600000000001,35.658000000000001,44.440200000000004,63.769200000000005,95.909400000000005,109.03680000000001,109.95479999999999,132.28405714285699,147.8835,163.482942857143]
[95,29.090399999999999,34.0884,43.7376,62.199599999999997,94.339799999999997,107.45699999999999,110.47620000000001,115.65779999999999,115.65779999999999,115.005,null,95,30.680399999999999,35.678400000000003,45.327600000000004,63.7896,95.9298,109.047,112.06620000000001,133.430828571429,149.198571428572,164.96631428571499]
[96,29.304600000000001,34.475999999999999,44.104800000000004,62.566800000000001,95.125200000000007,107.4774,111.6288,116.91240000000001,116.91240000000001,116.1474,null,96,30.894600000000001,36.066000000000003,45.694800000000008,64.156800000000004,96.71520000000001,109.06740000000001,113.2188,134.258485714286,150.11547857142901,165.97247142857199]
[97,29.6004,34.496400000000001,44.115000000000002,65.524799999999999,102.27539999999999,107.50800000000001,112.2102,118.03440000000001,118.03440000000001,117.2388,null,97,31.1904,36.086400000000005,45.705000000000005,67.114800000000002,103.86539999999999,109.09800000000001,113.8002,136.98188571428599,153.12520714285699,169.26852857142899]
[98,29.855399999999999,34.516800000000003,44.614800000000002,65.545200000000008,102.2958,111.7512,112.2306,118.065,118.065,117.32039999999999,null,98,31.445399999999999,36.106800000000007,46.204800000000006,67.135200000000012,103.8858,113.3412,113.8206,138.745028571429,155.147721428572,171.55041428571499]
[99,30.1206,34.873799999999996,44.635199999999998,65.565600000000003,102.31620000000001,111.77159999999999,112.24080000000001,118.1058,118.1058,117.37139999999999,null,99,31.710599999999999,36.463799999999999,46.225200000000001,67.155600000000007,103.90620000000001,113.3616,113.83080000000001,138.64157142857101,154.99289999999999,171.344228571428]
[100,30.3552,34.894199999999998,44.6556,65.575800000000001,104.09099999999999,112.1082,114.444,122.07360000000001,122.07360000000001,121.98180000000001,null,100,31.9452,36.484200000000001,46.245600000000003,67.165800000000004,105.681,113.6982,116.03400000000001,140.48339999999999,157.13089285714301,173.778385714286]
[101,30.651,35.241,45.094200000000001,66.218400000000003,105.1212,113.2098,115.5864,123.29759999999999,123.29759999999999,123.22620000000001,null,101,32.241,36.831000000000003,46.684200000000004,67.808400000000006,106.71120000000001,114.7998,117.1764,141.8604,158.67364285714299,175.48688571428599]
[102,30.957000000000001,35.261400000000002,45.532800000000002,66.891599999999997,106.18199999999999,114.342,116.72879999999999,124.51139999999999,124.51139999999999,124.4706,null,102,32.547000000000004,36.851400000000005,47.122800000000005,68.4816,107.77199999999999,115.932,118.3188,143.307342857143,160.31183571428599,177.31632857142901]
[103,31.262999999999998,35.577600000000004,46.002000000000002,67.554600000000008,107.22240000000001,115.464,117.8712,125.7456,125.7456,125.715,null,103,32.853000000000002,37.167600000000007,47.592000000000006,69.144600000000011,108.81240000000001,117.054,119.46120000000001,144.700371428571,161.87243571428499,179.0445]
[104,31.568999999999999,35.924399999999999,46.430400000000006,68.197199999999995,108.2526,116.586,119.0034,126.9594,126.9594,126.9594,null,104,33.158999999999999,37.514400000000002,48.020400000000009,69.787199999999999,109.8426,118.176,120.5934,146.07737142857101,163.414821428571,180.75227142857099]
[105,31.864799999999999,36.260999999999996,46.869,68.849999999999994,109.29300000000001,117.70800000000001,120.15599999999999,128.18340000000001,128.18340000000001,128.18340000000001,null,105,33.454799999999999,37.850999999999999,48.459000000000003,70.44,110.88300000000001,119.29800000000002,121.746,147.47477142857099,164.98161428571399,182.48845714285699]
[106,32.180999999999997,36.607799999999997,47.338199999999993,69.513000000000005,110.3334,118.8198,121.2984,129.3972,129.3972,129.42779999999999,null,106,33.771000000000001,38.197800000000001,48.928199999999997,71.103000000000009,111.9234,120.4098,122.8884,148.856142857143,166.52654999999999,184.196957142857]
[107,32.4666,36.954599999999999,47.776800000000001,70.165800000000004,111.384,119.9418,122.44080000000001,130.62120000000002,130.62120000000002,130.6824,null,107,34.056600000000003,38.544600000000003,49.366800000000005,71.755800000000008,112.974,121.5318,124.03080000000001,150.25208571428601,168.09152142857201,185.93095714285701]
[108,32.782800000000002,37.301400000000001,48.2256,70.818600000000004,112.41419999999999,121.0638,123.58319999999999,131.84519999999998,131.84519999999998,131.91660000000002,null,108,34.372800000000005,38.891400000000004,49.815600000000003,72.408600000000007,114.0042,122.6538,125.17319999999999,151.633457142857,169.63755,187.64164285714301]
[109,33.078600000000002,37.648199999999996,48.654000000000003,71.4816,113.4546,122.196,124.7256,133.059,133.059,133.161,null,109,34.668600000000005,39.238199999999999,50.244000000000007,73.071600000000004,115.0446,123.786,126.3156,153.02940000000001,171.202157142857,189.374914285714]
[110,33.394800000000004,37.9848,49.113,72.124199999999988,114.495,123.29759999999999,125.8884,134.28300000000002,134.28300000000002,134.38499999999999,null,110,34.984800000000007,39.574800000000003,50.703000000000003,73.714199999999991,116.08500000000001,124.88759999999999,127.47840000000001,154.41659999999999,172.75547142857101,191.094342857143]
[111,33.680400000000006,38.331600000000002,49.561800000000005,72.787199999999999,115.54560000000001,124.4196,127.0308,135.49680000000001,135.49680000000001,135.6396,null,111,35.270400000000009,39.921600000000005,51.151800000000009,74.377200000000002,117.13560000000001,126.00960000000001,128.6208,155.81399999999999,174.321535714286,192.82907142857101]
[112,33.996600000000001,38.678400000000003,50.000400000000006,73.450200000000009,116.586,125.5518,128.17320000000001,136.74119999999999,136.74119999999999,136.88399999999999,null,112,35.586600000000004,40.268400000000007,51.59040000000001,75.040200000000013,118.176,127.1418,129.76320000000001,157.20411428571401,175.87776428571399,194.551414285714]
[113,34.282199999999996,39.025199999999998,50.459400000000002,74.113199999999992,117.62639999999999,126.6738,129.31559999999999,137.94480000000001,137.94480000000001,138.1182,null,113,35.872199999999999,40.615200000000002,52.049400000000006,75.703199999999995,119.21639999999999,128.2638,130.90559999999999,158.5986,177.440185714286,196.28177142857101]
[114,34.598400000000005,39.361800000000002,50.908199999999994,74.755800000000008,118.66680000000001,127.77539999999999,130.4478,139.15860000000001,139.15860000000001,139.36259999999999,null,114,36.188400000000009,40.951800000000006,52.498199999999997,76.345800000000011,120.25680000000001,129.36539999999999,132.0378,159.968314285714,178.97309999999999,197.97788571428501]
[115,34.894199999999998,39.708599999999997,51.336599999999997,75.408600000000007,119.69699999999999,128.9076,131.59019999999998,140.3826,140.3826,140.5968,null,115,36.484200000000001,41.2986,52.926600000000001,76.99860000000001,121.28699999999999,130.49760000000001,133.18019999999999,161.35988571428601,180.53297142857201,199.70605714285699]
[116,35.2104,40.065600000000003,51.7956,76.071600000000004,120.7578,130.02960000000002,132.73259999999999,141.60660000000001,141.60660000000001,141.84120000000001,null,116,36.800400000000003,41.655600000000007,53.385600000000004,77.661600000000007,122.34780000000001,131.61960000000002,134.32259999999999,162.75,182.08774285714301,201.425485714286]
[117,35.5062,40.402200000000001,52.244399999999999,76.724400000000003,121.78800000000001,131.1618,133.875,142.8408,142.8408,143.0856,null,117,37.096200000000003,41.992200000000004,53.834400000000002,78.314400000000006,123.37800000000001,132.7518,135.465,164.143028571429,183.649071428572,203.155114285715]
[118,35.812199999999997,40.7592,52.683,77.3874,122.81819999999999,132.28379999999999,135.02760000000001,144.0444,144.0444,144.31980000000001,null,118,37.402200000000001,42.349200000000003,54.273000000000003,78.977400000000003,124.40819999999999,133.87379999999999,136.61760000000001,165.53314285714299,185.20566428571399,204.87818571428599]
[119,36.107999999999997,41.095799999999997,53.131800000000005,78.040199999999999,123.85860000000001,133.3956,136.16999999999999,145.27860000000001,145.27860000000001,145.5744,null,119,37.698,42.6858,54.721800000000009,79.630200000000002,125.44860000000001,134.98560000000001,137.76,166.920342857143,186.76007142857199,206.59979999999999]
[120,36.414000000000001,41.432399999999994,53.580600000000004,78.6828,124.9194,134.51759999999999,137.33279999999999,146.48220000000001,146.48220000000001,146.79839999999999,null,120,38.004000000000005,43.022399999999998,55.170600000000007,80.272800000000004,126.5094,136.10759999999999,138.9228,168.32502857142899,188.33451428571499,208.34399999999999]
[121,36.72,41.789400000000001,54.019199999999998,79.345800000000011,125.9496,135.6396,138.4752,147.7062,147.7062,148.0428,null,121,38.31,43.379400000000004,55.609200000000001,80.935800000000015,127.53960000000001,137.2296,140.0652,169.70931428571399,189.884185714285,210.059057142857]
[122,37.025999999999996,42.136200000000002,54.467999999999996,79.99860000000001,126.99,136.77180000000001,139.61759999999998,148.94040000000001,148.94040000000001,149.28720000000001,null,122,38.616,43.726200000000006,56.058,81.588600000000014,128.57999999999998,138.36180000000002,141.20759999999999,171.10088571428599,191.4426,211.784314285715]
[123,37.321800000000003,42.482999999999997,54.927,80.651399999999995,128.03039999999999,137.87339999999998,140.76,150.14399999999998,150.14399999999998,150.53160000000003,null,123,38.911800000000007,44.073,56.517000000000003,82.241399999999999,129.62039999999999,139.46339999999998,142.35,172.48225714285701,192.98935714285699,213.496457142857]
[124,37.627800000000001,42.819599999999994,55.365600000000001,81.314399999999992,129.07080000000002,138.99540000000002,141.8922,151.37819999999999,151.37819999999999,151.77600000000001,null,124,39.217800000000004,44.409599999999998,56.955600000000004,82.904399999999995,130.66080000000002,140.58540000000002,143.48220000000001,173.866542857143,194.53975714285701,215.21297142857199]
[125,37.9236,43.156200000000005,55.804200000000002,81.977400000000003,130.12139999999999,140.1276,143.03459999999998,152.60220000000001,152.60220000000001,153,null,125,39.513600000000004,44.746200000000009,57.394200000000005,83.567400000000006,131.7114,141.7176,144.62459999999999,175.26685714285699,196.10946428571401,216.952071428571]
[126,38.239800000000002,43.513199999999998,56.242800000000003,82.609799999999993,131.1618,141.24959999999999,144.17699999999999,153.8262,153.8262,154.25459999999998,null,126,39.829800000000006,45.103200000000001,57.832800000000006,84.199799999999996,132.7518,142.83959999999999,145.767,176.64677142857099,197.65403571428499,218.66130000000001]
[127,38.555999999999997,43.870199999999997,56.701800000000006,83.272800000000004,132.19200000000001,142.3716,145.3194,155.04,155.04,155.499,null,127,40.146000000000001,45.4602,58.291800000000009,84.862800000000007,133.78200000000001,143.9616,146.90940000000001,178.028142857143,199.19897142857201,220.3698]
[128,38.851800000000004,44.206800000000001,57.150600000000004,83.945999999999998,133.23240000000001,143.48339999999999,146.46180000000001,156.24360000000001,156.24360000000001,156.73320000000001,null,128,40.441800000000008,45.796800000000005,58.740600000000008,85.536000000000001,134.82240000000002,145.07339999999999,148.05180000000001,179.41825714285699,200.75629285714299,222.09432857142801]
[129,39.157800000000002,44.543399999999998,57.589199999999998,84.588600000000014,134.26259999999999,144.6054,147.60420000000002,157.47779999999997,157.47779999999997,157.9776,null,129,40.747800000000005,46.133400000000002,59.179200000000002,86.178600000000017,135.8526,146.19540000000001,149.19420000000002,180.80254285714301,202.30742142857201,223.81229999999999]
[130,39.453600000000002,44.900400000000005,58.058399999999999,85.241399999999999,135.32339999999999,145.72740000000002,148.77720000000002,158.70179999999999,158.70179999999999,159.21180000000001,null,130,41.043600000000005,46.490400000000008,59.648400000000002,86.831400000000002,136.9134,147.31740000000002,150.36720000000003,182.21451428571399,203.88915,225.56378571428499]
[131,39.759599999999999,45.237000000000002,58.486800000000002,85.904399999999995,136.3638,146.8494,149.9196,159.92579999999998,159.92579999999998,160.4562,null,131,41.349600000000002,46.827000000000005,60.076800000000006,87.494399999999999,137.9538,148.43940000000001,151.50960000000001,183.604628571429,205.44683571428601,227.28904285714299]
[132,40.065600000000003,45.594000000000001,58.925400000000003,86.546999999999997,137.4042,147.96119999999999,151.06199999999998,161.1396,161.1396,161.71080000000001,null,132,41.655600000000007,47.184000000000005,60.515400000000007,88.137,138.99420000000001,149.55119999999999,152.65199999999999,184.984542857143,206.99177142857201,228.999]
[133,40.371600000000001,45.930599999999998,59.394599999999997,87.220200000000006,138.43440000000001,149.08320000000001,152.20439999999999,162.36360000000002,162.36360000000002,162.9348,null,133,41.961600000000004,47.520600000000002,60.9846,88.810200000000009,140.02440000000001,150.67320000000001,153.7944,186.3732,208.54617857142799,230.719157142857]
[134,40.667400000000001,46.267200000000003,59.833199999999998,87.873000000000005,139.49519999999998,150.20519999999999,153.3366,163.57740000000001,163.57740000000001,164.18940000000001,null,134,42.257400000000004,47.857200000000006,61.423200000000001,89.463000000000008,141.08519999999999,151.79519999999999,154.92660000000001,187.76477142857101,210.10568571428499,232.44659999999999]
[135,40.983600000000003,46.624200000000002,60.271800000000006,88.536000000000001,140.53559999999999,151.3374,154.47899999999998,164.8014,164.8014,165.4134,null,135,42.573600000000006,48.214200000000005,61.861800000000009,90.126000000000005,142.12559999999999,152.92740000000001,156.06899999999999,189.153428571429,211.65972857142901,234.166028571429]
[136,41.269199999999998,46.960799999999999,60.7104,89.178600000000003,141.5556,152.45939999999999,155.62139999999999,166.02540000000002,166.02540000000002,166.65779999999998,null,136,42.859200000000001,48.550800000000002,62.300400000000003,90.768600000000006,143.1456,154.04939999999999,157.2114,190.54062857142901,213.21559285714301,235.890557142858]
[137,41.5854,47.317799999999998,61.169399999999996,89.831399999999988,142.596,153.56100000000001,156.7638,167.23920000000001,167.23920000000001,167.91239999999999,null,137,43.175400000000003,48.907800000000002,62.759399999999999,91.421399999999991,144.18600000000001,155.15100000000001,158.35380000000001,191.91471428571401,214.75215,237.58958571428499]
[138,41.8812,47.654399999999995,61.618199999999995,90.504600000000011,143.63639999999998,154.69319999999999,157.90620000000001,168.4632,168.4632,169.14660000000001,null,138,43.471200000000003,49.244399999999999,63.208199999999998,92.094600000000014,145.22639999999998,156.28319999999999,159.49620000000002,193.31357142857101,216.31967142857101,239.32577142857099]
[139,42.197399999999995,47.991,62.056800000000003,91.147199999999998,144.68699999999998,155.8152,159.04859999999999,169.68720000000002,169.68720000000002,170.39100000000002,null,139,43.787399999999998,49.581000000000003,63.646800000000006,92.737200000000001,146.27699999999999,157.40520000000001,160.6386,194.70077142857099,217.87334999999999,241.04592857142799]
[140,42.482999999999997,48.347999999999999,62.515799999999999,91.810200000000009,145.72740000000002,156.93720000000002,160.2114,170.91120000000001,170.91120000000001,171.61500000000001,null,140,44.073,49.938000000000002,64.105800000000002,93.400200000000012,147.31740000000002,158.52720000000002,161.8014,196.10545714285701,219.44742857142799,242.7894]
[141,42.799199999999999,48.704999999999998,62.9544,92.463000000000008,146.76779999999999,158.04899999999998,161.35380000000001,172.125,172.125,172.85939999999999,null,141,44.389200000000002,50.295000000000002,64.544399999999996,94.053000000000011,148.3578,159.63899999999998,162.94380000000001,197.48391428571401,220.989814285714,244.495714285714]
[142,43.084800000000001,49.041599999999995,63.393000000000001,93.105599999999995,147.8082,159.17100000000002,162.50639999999999,173.33879999999999,173.33879999999999,174.1242,null,142,44.674800000000005,50.631599999999999,64.983000000000004,94.695599999999999,149.3982,160.76100000000002,164.09639999999999,198.882771428571,222.559157142857,246.23554285714201]
[143,43.400999999999996,49.3782,63.831600000000002,93.778800000000004,148.8588,160.3032,163.64879999999999,174.56279999999998,174.56279999999998,175.34819999999999,null,143,44.991,50.968200000000003,65.421599999999998,95.368800000000007,150.44880000000001,161.89320000000001,165.2388,200.27871428571399,224.12230714285701,247.9659]
[144,43.696800000000003,49.725000000000001,64.300799999999995,94.431600000000003,149.89920000000001,161.42519999999999,164.78100000000001,175.7868,175.7868,176.5926,null,144,45.286800000000007,51.315000000000005,65.890799999999999,96.021600000000007,151.48920000000001,163.01519999999999,166.37100000000001,201.66300000000001,225.67197857142901,249.68095714285701]
[145,44.012999999999998,50.071800000000003,64.739400000000003,95.07419999999999,150.92939999999999,162.53700000000001,165.92339999999999,177.01079999999999,177.01079999999999,177.81660000000002,null,145,45.603000000000002,51.661800000000007,66.329400000000007,96.664199999999994,152.51939999999999,164.12700000000001,167.51339999999999,203.038542857143,227.21181428571401,251.38508571428599]
[146,44.308799999999998,50.428799999999995,65.188199999999995,95.737200000000001,151.96980000000002,163.65899999999999,167.0658,178.22459999999998,178.22459999999998,179.0712,null,146,45.898800000000001,52.018799999999999,66.778199999999998,97.327200000000005,153.55980000000002,165.249,168.6558,179.81459999999998,179.81459999999998,180.66120000000001]
[147,44.614800000000002,50.7654,65.637,96.400200000000012,153,164.78100000000001,168.20820000000001,179.4588,179.4588,180.32579999999999,null,147,46.204800000000006,52.355400000000003,67.227000000000004,97.990200000000016,154.59,166.37100000000001,169.79820000000001,181.0488,181.0488,181.91579999999999]
[148,44.910600000000002,51.102000000000004,66.075599999999994,97.032600000000002,154.0608,165.91319999999999,169.35060000000001,180.67259999999999,180.67259999999999,181.5498,null,148,46.500600000000006,52.692000000000007,67.665599999999998,98.622600000000006,155.6508,167.50319999999999,170.94060000000002,182.26259999999999,182.26259999999999,183.13980000000001]
[149,45.2166,51.459000000000003,66.5244,97.705800000000011,155.10120000000001,167.0352,170.51339999999999,181.88639999999998,181.88639999999998,182.79420000000002,null,149,46.806600000000003,53.049000000000007,68.114400000000003,99.295800000000014,156.69120000000001,168.62520000000001,172.10339999999999,183.47639999999998,183.47639999999998,184.38420000000002]
[150,45.522600000000004,51.7956,66.983400000000003,98.368799999999993,156.13139999999999,168.13679999999999,171.6558,183.1104,183.1104,184.02839999999998,null,150,47.112600000000008,53.385600000000004,68.573400000000007,99.958799999999997,157.72139999999999,169.7268,173.2458,184.7004,184.7004,185.61839999999998]

{"sheet":"2DA AM Multi","index":9,"n_rows":156,"n_cols":8,"rows_kept":156,"cut":false,"hidden":true,"merged":[[0,6,0,7]]}
["UPS Second Day Air AM Service"]
["- Commercial"]
["(Per Package Rates from 48 State Origin)"]
["-Second Day Air A.M. does not have a Residential option"]
["Lbs.",2,3,4,5,6,7,8]
[0.5,5.6406000000000001,5.6406000000000001,5.6406000000000001,6.2627999999999995,7.7519999999999998,8.0784000000000002,8.16]
[1,5.6916000000000002,5.6916000000000002,5.6916000000000002,5.6916000000000002,6.9053999999999993,7.2216000000000005,7.3338000000000001]
[2,5.6916000000000002,5.6916000000000002,5.6916000000000002,5.8548,7.6296000000000008,8.2926000000000002,8.6598000000000006]
[3,5.6916000000000002,5.6916000000000002,5.6916000000000002,6.4361999999999995,8.7617999999999991,9.6083999999999996,9.9450000000000003]
[4,5.6916000000000002,5.6916000000000002,5.6916000000000002,7.4867999999999997,10.118399999999999,10.975199999999999,11.321999999999999]
[5,5.6916000000000002,5.6916000000000002,6.12,8.2926000000000002,11.291399999999999,12.189,12.872399999999999]
[6,5.6916000000000002,5.6916000000000002,6.6402000000000001,9.0473999999999997,12.5562,13.545599999999999,14.1066]
[7,5.6916000000000002,5.9466000000000001,7.2216000000000005,9.883799999999999,14.1066,15.024600000000001,15.504]
[8,5.6916000000000002,6.4872000000000005,7.7316000000000003,10.7814,15.585599999999999,16.554600000000001,17.054399999999998]
[9,5.8548,6.7523999999999997,8.3333999999999993,11.566800000000001,16.932000000000002,18.145799999999998,18.737400000000001]
[10,6.0996000000000006,7.1706000000000003,8.9760000000000009,12.341999999999999,18.094799999999999,19.737000000000002,20.267400000000002]
[11,6.375,7.5582000000000003,9.3839999999999986,13.219200000000001,19.543199999999999,21.164999999999999,21.93]
[12,6.7115999999999998,8.0069999999999997,9.9042000000000012,13.9434,21.0426,22.674600000000002,23.439599999999999]
[13,7.1706000000000003,8.4149999999999991,10.2714,14.8002,22.3992,23.776199999999999,24.786000000000001]
[14,7.5174000000000003,8.8536000000000001,10.9344,15.6264,23.776199999999999,25.000200000000003,25.8978]
[15,7.8029999999999999,9.0678000000000001,11.4648,16.2486,25.000200000000003,26.132400000000001,27.070799999999998]
[16,8.0069999999999997,9.3635999999999999,11.9748,16.779,26.132400000000001,27.458400000000001,28.213200000000001]
[17,8.2620000000000005,9.6696000000000009,12.4848,17.544,27.3156,28.927199999999999,29.539200000000001]
[18,8.547600000000001,9.9756,12.953999999999999,18.176400000000001,28.4376,30.202199999999998,31.293600000000001]
[19,8.8536000000000001,10.251000000000001,13.321200000000001,18.920999999999999,29.488199999999999,31.6098,32.313600000000001]
[20,9.18,10.679400000000001,13.821000000000002,19.798200000000001,30.508199999999999,32.660400000000003,33.486599999999996]
[21,9.6083999999999996,11.118,14.361599999999999,20.440799999999999,31.6098,33.7926,35.047199999999997]
[22,9.883799999999999,11.638199999999999,14.759400000000001,21.022199999999998,32.629799999999996,35.077800000000003,36.342600000000004]
[23,10.1388,11.9034,15.248999999999999,21.623999999999999,33.7926,36.220199999999998,37.709400000000002]
[24,10.363200000000001,12.341999999999999,15.7386,22.4604,35.026800000000001,37.627800000000001,39.0456]
[25,10.679400000000001,12.709200000000001,16.065000000000001,23.245799999999999,36.169200000000004,38.994599999999998,40.361400000000003]
[26,11.005799999999999,13.056000000000001,16.656599999999997,23.9802,37.393199999999993,40.29,41.463000000000001]
[27,11.373000000000001,13.413,17.095200000000002,24.847200000000001,38.658000000000001,41.656800000000004,42.778799999999997]
[28,11.7096,13.882199999999999,17.442,25.438800000000001,39.6372,42.7074,43.8294]
[29,12.066599999999999,14.126999999999999,17.982599999999998,26.020200000000003,40.708199999999998,43.8294,45.114599999999996]
[30,12.2706,14.5044,18.604799999999997,26.877000000000002,41.809800000000003,44.981999999999999,46.2468]
[31,12.627600000000001,14.973599999999999,19.125,27.468599999999999,42.778799999999997,45.961200000000005,47.480999999999995]
[32,12.821400000000001,15.320399999999999,19.6554,28.1418,44.002800000000001,47.225999999999999,48.633600000000001]
[33,13.168200000000001,15.708,20.175600000000003,28.733400000000003,45.196200000000005,48.317399999999999,49.857600000000005]
[34,13.6068,16.003799999999998,20.634599999999999,29.753400000000003,46.583400000000005,49.490400000000001,51.102000000000004]
[35,13.872,16.4832,21.0732,30.334799999999998,47.970600000000005,50.755199999999995,52.3566]
[36,14.0556,16.860600000000002,21.481199999999998,30.9468,49.276200000000003,52.3566,53.682600000000001]
[37,14.320799999999998,17.115600000000001,22.0014,31.752599999999997,50.602199999999996,53.754000000000005,55.1004]
[38,14.586,17.391000000000002,22.582799999999999,32.395200000000003,51.897600000000004,55.1616,56.61]
[39,15.024600000000001,17.819399999999998,22.9602,33.0276,53.131800000000005,56.61,58.078800000000001]
[40,15.432600000000001,18.288599999999999,23.490600000000001,33.7926,54.366,57.997199999999999,59.384399999999999]
[41,15.830399999999999,18.7272,23.755800000000001,34.424999999999997,55.559399999999997,59.486400000000003,60.995999999999995]
[42,16.065000000000001,19.165800000000001,24.225000000000001,35.118600000000001,56.752800000000001,60.995999999999995,62.515799999999999]
[43,16.411799999999999,19.584,24.6126,35.689800000000005,58.078800000000001,62.117999999999995,63.800999999999995]
[44,16.727999999999998,19.8492,25.142999999999997,36.342600000000004,59.221200000000003,63.168599999999998,65.065799999999996]
[45,17.095200000000002,20.297999999999998,25.510200000000001,36.852600000000002,60.271800000000006,64.321200000000005,66.024600000000007]
[46,17.268599999999999,20.532599999999999,26.040600000000001,37.434000000000005,61.322399999999995,65.361599999999996,67.636200000000002]
[47,17.656199999999998,20.930399999999999,26.509799999999998,37.9542,62.515799999999999,66.391800000000003,68.941800000000001]
[48,17.982599999999998,21.42,26.968800000000002,38.505000000000003,63.617399999999996,67.534199999999998,70.073999999999998]
[49,18.339600000000001,21.93,27.4176,39.167999999999999,64.688400000000001,68.493000000000009,71.420400000000001]
[50,18.614999999999998,22.215600000000002,27.856199999999998,39.841200000000001,65.800200000000004,69.5334,72.542400000000001]
[51,18.880200000000002,22.4604,28.325399999999998,40.422600000000003,66.901800000000009,70.828800000000001,73.807199999999995]
[52,19.125,22.797000000000001,28.845600000000001,41.381399999999999,67.901399999999995,72.114000000000004,75.102599999999995]
[53,19.482000000000003,23.245799999999999,29.243400000000001,41.993400000000001,68.941800000000001,73.38900000000001,76.020600000000002]
[54,19.757400000000001,23.633400000000002,29.682000000000002,42.656399999999998,70.073999999999998,74.827200000000005,77.163000000000011]
[55,20.145,24.031199999999998,30.049200000000003,43.431599999999996,71.338799999999992,76.2654,78.315600000000003]
[56,20.430600000000002,24.337199999999999,30.477599999999999,44.115000000000002,72.42,77.458799999999997,79.713000000000008]
[57,20.685600000000001,24.734999999999999,30.967199999999998,44.727000000000004,73.684799999999996,78.733800000000002,81.191999999999993]
[58,21.0732,25.142999999999997,31.528200000000002,45.461399999999998,75.102599999999995,80.080200000000005,82.436399999999992]
[59,21.3384,25.438800000000001,32.119799999999998,46.287600000000005,76.489799999999988,81.385800000000003,83.752200000000002]
[60,21.5322,25.704000000000001,32.629799999999996,46.940400000000004,77.836200000000005,82.783199999999994,84.802800000000005]
[61,21.93,26.040600000000001,33.068400000000004,47.532000000000004,78.999000000000009,83.721599999999995,86.19]
[62,22.337999999999997,26.550600000000003,33.466200000000001,48.317399999999999,80.080200000000005,85.149600000000007,87.699600000000004]
[63,22.674600000000002,26.968800000000002,33.904800000000002,48.949800000000003,81.263400000000004,86.536799999999999,89.372399999999999]
[64,23.0928,27.366599999999998,34.292400000000001,49.6128,82.456800000000001,87.954599999999999,90.535200000000003]
[65,23.439599999999999,27.784799999999997,34.822800000000001,50.367600000000003,83.680800000000005,89.413200000000003,92.095800000000011]
[66,23.735399999999998,28.05,35.292000000000002,51.173400000000001,85.047599999999989,90.535200000000003,93.748199999999997]
[67,23.9496,28.590600000000002,35.853000000000002,52.009799999999998,86.098199999999991,91.871399999999994,95.0946]
[68,24.225000000000001,28.845600000000001,36.342600000000004,52.897199999999998,87.250800000000012,93.095399999999998,96.308400000000006]
[69,24.632999999999999,29.2638,36.822000000000003,53.876400000000004,88.3626,94.370399999999989,97.991399999999999]
[70,25.000200000000003,29.702400000000001,37.393199999999993,54.804599999999994,89.413200000000003,95.543400000000005,99.072599999999994]
[71,25.3368,30.100200000000001,37.903199999999998,55.559399999999997,90.616799999999998,96.634799999999998,100.3884]
[72,25.642800000000001,30.661199999999997,38.372399999999999,56.395800000000001,91.871399999999994,98.021999999999991,101.89800000000001]
[73,25.877400000000002,30.906000000000002,38.933399999999999,57.3444,93.166800000000009,99.368400000000008,103.04039999999999]
[74,26.244600000000002,31.293600000000001,39.463799999999999,58.078800000000001,94.421399999999991,100.878,104.601]
[75,26.611799999999999,31.783200000000001,39.912600000000005,58.874400000000001,95.706599999999995,102.2244,105.9984]
[76,26.897400000000001,32.1402,40.381800000000005,59.5578,96.247199999999992,103.7034,107.14080000000001]
[77,27.366599999999998,32.558399999999999,40.891800000000003,60.312600000000003,98.317800000000005,104.907,108.4362]
[78,27.6114,32.833799999999997,41.483400000000003,61.189800000000005,98.338200000000001,106.2432,109.32360000000001]
[79,27.947999999999997,33.241800000000005,42.044399999999996,62.077199999999998,100.9494,107.45699999999999,111.1494]
[80,28.3764,33.649799999999999,42.656399999999998,62.872799999999998,102.2244,108.8034,111.1698]
[81,28.631399999999999,34.006800000000005,42.666599999999995,62.893199999999993,102.2448,108.82379999999999,111.1902]
[82,28.957799999999999,34.445400000000006,43.604999999999997,64.484399999999994,104.5806,111.53699999999999,115.18860000000001]
[83,29.151599999999998,34.843199999999996,44.165999999999997,64.525199999999998,105.774,111.9552,116.55539999999999]
[84,29.518800000000002,35.292000000000002,44.553600000000003,65.626800000000003,105.80460000000001,114.53580000000001,117.6978]
[85,29.875799999999998,35.761200000000002,45.002399999999994,66.677400000000006,108.1506,116.06580000000001,118.95240000000001]
[86,30.294,35.781599999999997,45.532800000000002,67.462800000000001,108.17099999999999,117.5652,120.3396]
[87,30.508199999999999,36.505800000000001,46.032600000000002,68.21759999999999,108.19139999999999,117.5856,121.533]
[88,30.7836,36.944400000000002,46.583400000000005,68.849999999999994,108.2016,117.60599999999999,121.56360000000001]
[89,31.120200000000001,37.179000000000002,47.032199999999996,69.502800000000008,108.22199999999999,117.62639999999999,121.584]
[90,31.6404,37.556400000000004,47.501400000000004,70.216800000000006,112.78139999999999,123.1752,125.75580000000001]
[91,32.089199999999998,38.025600000000004,47.511600000000001,71.114400000000003,112.8018,124.7256,127.11240000000001]
[92,32.487000000000002,38.413199999999996,48.4908,71.134799999999998,112.84259999999999,124.73580000000001,128.38740000000001]
[93,32.7624,38.994599999999998,48.511200000000002,71.165399999999991,112.8528,124.75620000000001,128.41800000000001]
[94,33.0276,39.004800000000003,49.0518,71.1858,112.8732,128.5812,129.68280000000001]
[95,33.302999999999997,39.025199999999998,50.071800000000003,71.216399999999993,112.89360000000001,128.61180000000002,132.19200000000001]
[96,33.558,39.463799999999999,50.49,71.624399999999994,113.83199999999999,128.63220000000001,133.58940000000001]
[97,33.904800000000002,39.484200000000001,50.510400000000004,75.000600000000006,122.4102,128.65260000000001,134.28300000000002]
[98,34.190400000000004,39.514800000000001,51.071399999999997,75.021000000000001,122.4204,133.73220000000001,134.29319999999998]
[99,34.486200000000004,39.933,51.102000000000004,75.071999999999989,122.44080000000001,133.7526,134.33399999999997]
[100,34.751400000000004,39.953400000000002,51.122399999999999,75.0822,124.58280000000001,134.15040000000002,136.96559999999999]
[101,35.098199999999999,40.340999999999994,51.632399999999997,75.806399999999996,125.80680000000001,135.47639999999998,138.32220000000001]
[102,35.434800000000003,40.361400000000003,52.142399999999995,76.561199999999999,127.0716,136.833,139.69920000000002]
[103,35.781599999999997,40.7286,52.662600000000005,77.3262,128.3058,138.16920000000002,141.0558]
[104,36.148799999999994,41.126400000000004,53.152200000000001,78.070800000000006,129.56039999999999,139.51560000000001,142.43279999999999]
[105,36.465000000000003,41.503799999999998,53.662199999999999,78.805199999999999,130.78440000000001,140.87220000000002,143.7792]
[106,36.8322,41.901599999999995,54.192600000000006,79.580399999999997,132.03899999999999,142.19819999999999,145.16639999999998]
[107,37.179000000000002,42.299399999999999,54.682200000000002,80.314799999999991,133.3038,143.53440000000001,146.523]
[108,37.515599999999999,42.7074,55.1922,81.069600000000008,134.53800000000001,144.90119999999999,147.9]
[109,37.872600000000006,43.094999999999999,55.702199999999998,81.834600000000009,135.7824,146.23740000000001,149.25660000000002]
[110,38.229599999999998,43.482600000000005,56.2224,82.558799999999991,137.01660000000001,147.5532,150.654]
[111,38.555999999999997,43.880400000000002,56.732399999999998,83.323799999999991,138.28139999999999,148.89959999999999,152.01060000000001]
[112,38.923199999999994,44.278199999999998,57.242399999999996,84.078600000000009,139.51560000000001,150.25620000000001,153.38759999999999]
[113,39.259799999999998,44.675999999999995,57.772800000000004,84.843600000000009,140.76,151.5924,154.74420000000001]
[114,39.6066,45.053400000000003,58.272600000000004,85.567800000000005,141.99420000000001,152.91839999999999,156.12120000000002]
[115,39.953400000000002,45.461399999999998,58.782600000000002,86.322599999999994,143.23860000000002,154.27500000000001,157.47779999999997]
[116,40.310400000000001,45.849000000000004,59.312999999999995,87.087599999999995,144.5136,155.6112,158.85480000000001]
[117,40.636800000000001,46.2468,59.802600000000005,87.8322,145.74779999999998,156.94740000000002,160.2114]
[118,41.004000000000005,46.664999999999999,60.312600000000003,88.576800000000006,146.99220000000003,158.3142,161.58839999999998]
[119,41.340600000000002,47.032199999999996,60.812399999999997,89.331599999999995,148.22639999999998,159.63,162.94499999999999]
[120,41.687399999999997,47.440199999999997,61.342800000000004,90.0762,149.49119999999999,160.97639999999998,164.3424]
[121,42.024000000000001,47.848199999999999,61.842600000000004,90.831000000000003,150.72540000000001,162.3126,165.69899999999998]
[122,42.391200000000005,48.245999999999995,62.342399999999998,91.585800000000006,151.96980000000002,163.67939999999999,167.07600000000002]
[123,42.727800000000002,48.633600000000001,62.872799999999998,92.3202,153.2244,164.99519999999998,168.43260000000001]
[124,43.074599999999997,49.0212,63.382800000000003,93.075000000000003,154.45860000000002,166.3314,169.80959999999999]
[125,43.431599999999996,49.419000000000004,63.892800000000001,93.850200000000001,155.7234,167.69819999999999,171.1662]
[126,43.778400000000005,49.826999999999998,64.392600000000002,94.5642,156.94740000000002,169.02420000000001,172.55339999999998]
[127,44.1252,50.214599999999997,64.923000000000002,95.3292,158.202,170.3706,173.8998]
[128,44.482199999999999,50.612399999999994,65.433000000000007,96.094200000000001,159.43620000000001,171.69660000000002,175.28700000000001]
[129,44.829000000000001,51,65.922599999999989,96.828600000000009,160.6806,173.0532,176.63339999999999]
[130,45.165599999999998,51.387600000000006,66.442800000000005,97.5732,161.9556,174.38939999999999,178.04100000000003]
[131,45.532800000000002,51.7956,66.952799999999996,98.338200000000001,163.18980000000002,175.73579999999998,179.40779999999998]
[132,45.849000000000004,52.193400000000004,67.462800000000001,99.072599999999994,164.4342,177.072,180.77459999999999]
[133,46.216200000000001,52.570799999999998,67.983000000000004,99.837599999999995,165.65819999999999,178.40819999999999,182.1414]
[134,46.562999999999995,52.968600000000002,68.493000000000009,100.6026,166.9332,179.75459999999998,183.50819999999999]
[135,46.8996,53.366399999999999,68.992800000000003,101.33699999999999,168.16740000000001,181.1112,184.875]
[136,47.246400000000001,53.764200000000002,69.502800000000008,102.08159999999999,169.4118,182.45759999999999,186.24180000000001]
[137,47.613599999999998,54.172199999999997,70.02300000000001,102.8466,170.64600000000002,183.77339999999998,187.6086]
[138,47.9298,54.539400000000001,70.533000000000001,103.6014,171.9006,185.1198,188.97540000000001]
[139,48.297000000000004,54.947399999999995,71.043000000000006,104.33580000000001,173.16540000000001,186.47639999999998,190.34220000000002]
[140,48.633600000000001,55.345199999999998,71.563199999999995,105.09059999999999,174.38939999999999,187.8126,191.7294]
[141,48.980400000000003,55.732799999999997,72.0732,105.8454,175.64399999999998,189.1386,193.09620000000001]
[142,49.337399999999995,56.140799999999999,72.562799999999996,106.59,176.87819999999999,190.48500000000001,194.46299999999999]
[143,49.684200000000004,56.518199999999993,73.072800000000001,107.33460000000001,178.143,191.8314,195.82980000000001]
[144,50.020800000000001,56.926200000000001,73.603200000000001,108.09960000000001,179.36699999999999,193.16759999999999,197.19660000000002]
[145,50.387999999999998,57.313800000000001,74.103000000000009,108.834,180.6216,194.51399999999998,198.5736]
[146,50.724599999999995,57.711599999999997,74.613,109.599,181.85579999999999,195.8502,199.93019999999999]
[147,51.071399999999997,58.129800000000003,75.1434,110.34360000000001,183.1002,197.19660000000002,201.30720000000002]
[148,51.408000000000001,58.486800000000002,75.643199999999993,111.078,184.36500000000001,198.5532,202.66380000000001]
[149,51.775199999999998,58.905000000000001,76.143000000000001,111.843,185.60939999999999,199.89959999999999,204.05100000000002]
[150,51.2878061208053,58.8061343892617,75.887581046979903,111.713680429531,185.14954383892601,199.742524563758,204.073726604027]

{"sheet":"3DS Multi","index":10,"n_rows":156,"n_cols":17,"rows_kept":156,"cut":false,"hidden":true,"merged":[[0,9,0,14],[1,6,1,7],[1,14,1,16]]}
[null,null,null,null,null,null,null,null,null,"Residential Surcharge",null,null,null,null,null,1.59]
["UPS Three Day Select Service",null,null,null,null,null,null,null,null,"UPS Three Day Select Service"]
["- Commercial",null,null,null,null,null,null,null,null,"- Residential"]
["(Per Package Rates from 48 State Origin)",null,null,null,null,null,null,null,null,"(Per Package Rates from 48 State Origin)"]
["Rates below do not include Residential Surcharge",null,null,null,null,null,null,null,null,"Rates Include Residential Surcharge"]
["Lbs.",2,3,4,5,6,7,8,null,"Lbs.",2,3,4,5,6,7,8]
[1,4.7940000000000005,4.7940000000000005,4.7940000000000005,4.7940000000000005,5.1203999999999992,5.7527999999999997,5.9466000000000001,null,1,6.3840000000000003,6.3840000000000003,6.3840000000000003,6.3840000000000003,6.710399999999999,7.3427999999999995,7.5366]
[2,4.7940000000000005,4.7940000000000005,4.7940000000000005,4.7940000000000005,5.9466000000000001,6.4260000000000002,6.9461999999999993,null,2,6.3840000000000003,6.3840000000000003,6.3840000000000003,6.3840000000000003,7.5366,8.016,8.5361999999999991]
[3,4.7940000000000005,4.7940000000000005,4.7940000000000005,4.9980000000000002,6.7422000000000004,7.3133999999999997,7.9253999999999998,null,3,6.3840000000000003,6.3840000000000003,6.3840000000000003,6.5880000000000001,8.3322000000000003,8.9033999999999995,9.5153999999999996]
[4,4.7940000000000005,4.7940000000000005,4.7940000000000005,5.5793999999999997,7.5275999999999996,8.2721999999999998,8.8230000000000004,null,4,6.3840000000000003,6.3840000000000003,6.3840000000000003,7.1693999999999996,9.1175999999999995,9.8621999999999996,10.413]
[5,4.7940000000000005,4.7940000000000005,5.1203999999999992,6.1301999999999994,8.2721999999999998,9.1698000000000004,9.6798000000000002,null,5,6.3840000000000003,6.3840000000000003,6.710399999999999,7.7201999999999993,9.8621999999999996,10.7598,11.2698]
[6,4.7940000000000005,4.8449999999999998,5.508,6.681,8.9453999999999994,10.0776,10.6896,null,6,6.3840000000000003,6.4349999999999996,7.0979999999999999,8.2710000000000008,10.535399999999999,11.6676,12.2796]
[7,4.7940000000000005,5.2427999999999999,5.9874000000000001,7.1603999999999992,9.6798000000000002,10.8324,11.699400000000001,null,7,6.3840000000000003,6.8327999999999998,7.5773999999999999,8.7503999999999991,11.2698,12.4224,13.289400000000001]
[8,4.7940000000000005,5.6711999999999998,6.4464000000000006,7.6601999999999997,10.475399999999999,11.699400000000001,12.801,null,8,6.3840000000000003,7.2611999999999997,8.0364000000000004,9.2501999999999995,12.065399999999999,13.289400000000001,14.391]
[9,4.7940000000000005,5.9874000000000001,6.8340000000000005,8.16,11.1996,12.4848,13.718999999999999,null,9,6.3840000000000003,7.5773999999999999,8.4240000000000013,9.75,12.7896,14.0748,15.308999999999999]
[10,5.0490000000000004,6.3342000000000001,7.2624000000000004,8.710799999999999,11.8116,13.3314,14.7798,null,10,6.6390000000000002,7.9241999999999999,8.8524000000000012,10.300799999999999,13.4016,14.9214,16.369800000000001]
[11,5.2835999999999999,6.681,7.6601999999999997,9.1289999999999996,12.5562,14.126999999999999,15.6264,null,11,6.8735999999999997,8.2710000000000008,9.2501999999999995,10.718999999999999,14.1462,15.716999999999999,17.2164]
[12,5.5590000000000002,7.0278,8.0988000000000007,9.5982000000000003,13.392600000000002,14.8818,16.574999999999999,null,12,7.149,8.6178000000000008,9.6888000000000005,11.1882,14.982600000000001,16.471800000000002,18.164999999999999]
[13,5.8140000000000001,7.3338000000000001,8.5068000000000001,10.148999999999999,14.147399999999999,15.8508,17.533800000000003,null,13,7.4039999999999999,8.9238,10.0968,11.738999999999999,15.737399999999999,17.440799999999999,19.123800000000003]
[14,6.0077999999999996,7.6806000000000001,8.9453999999999994,10.6488,14.8818,16.687200000000001,18.451799999999999,null,14,7.5977999999999994,9.2706,10.535399999999999,12.238799999999999,16.471800000000002,18.277200000000001,20.041799999999999]
[15,6.3342000000000001,8.0069999999999997,9.3431999999999995,11.179200000000002,15.687600000000002,17.492999999999999,19.4922,null,15,7.9241999999999999,9.5969999999999995,10.933199999999999,12.769200000000001,17.277600000000003,19.082999999999998,21.0822]
[16,6.4668000000000001,8.1191999999999993,9.536999999999999,11.699400000000001,16.330200000000001,18.308999999999997,20.430600000000002,null,16,8.0568000000000008,9.7091999999999992,11.126999999999999,13.289400000000001,17.920200000000001,19.898999999999997,22.020600000000002]
[17,6.681,8.4047999999999998,9.9450000000000003,12.199200000000001,16.921800000000001,19.002599999999997,21.267000000000003,null,17,8.2710000000000008,9.9947999999999997,11.535,13.789200000000001,18.511800000000001,20.592599999999997,22.857000000000003]
[18,6.9257999999999997,8.710799999999999,10.312199999999999,12.709200000000001,17.492999999999999,19.737000000000002,22.0014,null,18,8.5158000000000005,10.300799999999999,11.902199999999999,14.299200000000001,19.082999999999998,21.327000000000002,23.5914]
[19,7.1093999999999999,8.9862000000000002,10.6692,13.2294,18.1356,20.481599999999997,22.766400000000001,null,19,8.6994000000000007,10.5762,12.2592,14.8194,19.7256,22.071599999999997,24.356400000000001]
[20,7.3949999999999996,9.282,11.179200000000002,13.668000000000001,18.767999999999997,21.287400000000002,23.663999999999998,null,20,8.9849999999999994,10.872,12.769200000000001,15.258000000000001,20.357999999999997,22.877400000000002,25.253999999999998]
[21,7.5990000000000002,9.5064000000000011,11.526000000000002,14.1066,19.277999999999999,22.103400000000001,24.459600000000002,null,21,9.1890000000000001,11.096400000000001,13.116000000000001,15.6966,20.867999999999999,23.6934,26.049600000000002]
[22,7.7724000000000002,9.8328000000000007,11.913599999999999,14.657399999999999,19.971599999999999,22.837800000000001,25.357199999999999,null,22,9.3624000000000009,11.422800000000001,13.503599999999999,16.247399999999999,21.561599999999999,24.427800000000001,26.947199999999999]
[23,8.0784000000000002,10.098000000000001,12.4032,15.1776,20.634599999999999,23.592599999999997,26.203800000000001,null,23,9.6684000000000001,11.688000000000001,13.9932,16.767600000000002,22.224599999999999,25.182599999999997,27.793800000000001]
[24,8.3436000000000003,10.404,12.688799999999999,15.565199999999999,21.379200000000001,24.367799999999999,27.091199999999997,null,24,9.9336000000000002,11.994,14.278799999999999,17.155200000000001,22.969200000000001,25.957799999999999,28.681199999999997]
[25,8.6496000000000013,10.791600000000001,13.0764,16.116,22.042200000000001,25.2348,27.937799999999999,null,25,10.239600000000001,12.381600000000001,14.666399999999999,17.706,23.632200000000001,26.8248,29.527799999999999]
[26,8.8842000000000017,11.1996,13.515000000000001,16.758600000000001,22.746000000000002,26.040600000000001,28.784399999999998,null,26,10.474200000000002,12.7896,15.105,18.348600000000001,24.336000000000002,27.630600000000001,30.374399999999998]
[27,9.190199999999999,11.587199999999999,13.963799999999999,17.299200000000003,23.572199999999999,26.978999999999999,29.702400000000001,null,27,10.780199999999999,13.177199999999999,15.553799999999999,18.889200000000002,25.162199999999999,28.568999999999999,31.292400000000001]
[28,9.4655999999999985,11.8728,14.361599999999999,17.850000000000001,24.367799999999999,27.835799999999999,30.589799999999997,null,28,11.055599999999998,13.4628,15.951599999999999,19.440000000000001,25.957799999999999,29.425799999999999,32.1798]
[29,9.7818000000000005,12.2502,14.8002,18.2682,25.041,28.6008,31.568999999999999,null,29,11.3718,13.840199999999999,16.3902,19.8582,26.631,30.190799999999999,33.158999999999999]
[30,9.9960000000000004,12.5052,15.1776,18.7272,25.887599999999999,29.376000000000001,32.487000000000002,null,30,11.586,14.0952,16.767600000000002,20.3172,27.477599999999999,30.966000000000001,34.077000000000005]
[31,10.240799999999998,12.872399999999999,15.565199999999999,19.277999999999999,26.6526,30.2532,33.405000000000001,null,31,11.830799999999998,14.462399999999999,17.155200000000001,20.867999999999999,28.242599999999999,31.8432,34.995000000000005]
[32,10.4346,13.209,16.0242,19.798200000000001,27.325799999999997,31.058999999999997,34.312800000000003,null,32,12.0246,14.798999999999999,17.6142,21.388200000000001,28.915799999999997,32.649000000000001,35.902800000000006]
[33,10.6896,13.515000000000001,16.411799999999999,20.297999999999998,28.070399999999999,31.8444,35.2104,null,33,12.2796,15.105,18.001799999999999,21.887999999999998,29.660399999999999,33.434400000000004,36.800400000000003]
[34,10.954800000000001,13.851599999999999,16.8096,20.848800000000001,28.845600000000001,32.6706,36.281399999999998,null,34,12.5448,15.441599999999999,18.3996,22.438800000000001,30.435600000000001,34.260600000000004,37.871400000000001]
[35,11.1486,14.126999999999999,17.258400000000002,21.3996,29.4984,33.445799999999998,37.138199999999998,null,35,12.7386,15.716999999999999,18.848400000000002,22.989599999999999,31.0884,35.035800000000002,38.728200000000001]
[36,11.434200000000001,14.443200000000001,17.676599999999997,21.858599999999999,30.273599999999998,34.159800000000004,37.994999999999997,null,36,13.0242,16.033200000000001,19.266599999999997,23.448599999999999,31.863599999999998,35.749800000000008,39.585000000000001]
[37,11.6586,14.820599999999999,18.053999999999998,22.2972,30.8856,34.832999999999998,38.821200000000005,null,37,13.2486,16.410599999999999,19.643999999999998,23.8872,32.4756,36.423000000000002,40.411200000000008]
[38,11.913599999999999,15.106200000000001,18.523199999999999,22.837800000000001,31.538400000000003,35.516399999999997,39.576000000000001,null,38,13.503599999999999,16.696200000000001,20.113199999999999,24.427800000000001,33.128400000000006,37.106400000000001,41.166000000000004]
[39,12.2502,15.412199999999999,18.839399999999998,23.357999999999997,32.262599999999999,36.169200000000004,40.351200000000006,null,39,13.840199999999999,17.002199999999998,20.429399999999998,24.947999999999997,33.852600000000002,37.759200000000007,41.941200000000009]
[40,12.464400000000001,15.779400000000001,19.186199999999999,23.8782,32.986800000000002,36.872999999999998,41.085599999999999,null,40,14.054400000000001,17.369400000000002,20.776199999999999,25.4682,34.576800000000006,38.463000000000001,42.675600000000003]
[41,12.688799999999999,16.003799999999998,19.604399999999998,24.398400000000002,33.537600000000005,37.627800000000001,41.972999999999999,null,41,14.278799999999999,17.593799999999998,21.194399999999998,25.988400000000002,35.127600000000008,39.217800000000004,43.563000000000002]
[42,12.9132,16.371000000000002,20.022600000000001,24.99,34.241399999999999,38.433599999999998,42.870600000000003,null,42,14.5032,17.961000000000002,21.6126,26.58,35.831400000000002,40.023600000000002,44.460600000000007]
[43,13.188599999999999,16.8096,20.410200000000003,25.510200000000001,34.904399999999995,39.270000000000003,43.8294,null,43,14.778599999999999,18.3996,22.000200000000003,27.100200000000001,36.494399999999999,40.860000000000007,45.419400000000003]
[44,13.392600000000002,17.054399999999998,20.848800000000001,26.061,35.628599999999999,40.096200000000003,44.788199999999996,null,44,14.982600000000001,18.644399999999997,22.438800000000001,27.651,37.218600000000002,41.686200000000007,46.3782]
[45,13.6884,17.380800000000001,21.3078,26.540399999999998,36.3018,40.942799999999998,45.6858,null,45,15.2784,18.970800000000001,22.8978,28.130399999999998,37.891800000000003,42.532800000000002,47.275800000000004]
[46,13.923,17.676599999999997,21.644399999999997,27.091199999999997,37.036200000000001,41.717999999999996,46.756800000000005,null,46,15.513,19.266599999999997,23.234399999999997,28.681199999999997,38.626200000000004,43.308,48.346800000000009]
[47,14.126999999999999,18.053999999999998,22.0626,27.591000000000001,37.913400000000003,42.564599999999999,47.766599999999997,null,47,15.716999999999999,19.643999999999998,23.6526,29.181000000000001,39.503400000000006,44.154600000000002,49.3566]
[48,14.4024,18.4314,22.358400000000003,28.070399999999999,38.7804,43.421399999999998,48.684599999999996,null,48,15.9924,20.0214,23.948400000000003,29.660399999999999,40.370400000000004,45.011400000000002,50.2746]
[49,14.657399999999999,18.655799999999999,22.746000000000002,28.6008,39.688199999999995,44.339399999999998,49.673999999999999,null,49,16.247399999999999,20.245799999999999,24.336000000000002,30.190799999999999,41.278199999999998,45.929400000000001,51.264000000000003]
[50,14.841000000000001,18.941400000000002,23.154,29.059799999999999,40.473599999999998,45.226800000000004,50.591999999999999,null,50,16.431000000000001,20.531400000000001,24.744,30.649799999999999,42.063600000000001,46.816800000000008,52.182000000000002]
[51,15.055199999999999,19.298400000000001,23.5518,29.5596,41.177399999999999,46.124400000000001,51.346800000000002,null,51,16.645199999999999,20.888400000000001,25.1418,31.1496,42.767400000000002,47.714400000000005,52.936800000000005]
[52,15.2796,19.665600000000001,23.9496,30.018599999999999,41.799599999999998,46.970999999999997,52.193400000000004,null,52,16.869600000000002,21.255600000000001,25.5396,31.608599999999999,43.389600000000002,48.561,53.783400000000007]
[53,15.5448,20.022600000000001,24.398400000000002,30.528600000000001,42.523799999999994,47.848199999999999,53.1828,null,53,17.134800000000002,21.6126,25.988400000000002,32.118600000000001,44.113799999999998,49.438200000000002,54.772800000000004]
[54,15.799799999999999,20.369399999999999,24.847200000000001,31.058999999999997,43.156200000000005,48.745800000000003,54.090600000000002,null,54,17.389800000000001,21.959399999999999,26.437200000000001,32.649000000000001,44.746200000000009,50.335800000000006,55.680600000000005]
[55,15.9834,20.593800000000002,25.2348,31.589399999999998,43.8294,49.653599999999997,55.049399999999999,null,55,17.573399999999999,22.183800000000002,26.8248,33.179400000000001,45.419400000000003,51.243600000000001,56.639400000000002]
[56,16.238399999999999,20.961000000000002,25.6326,32.089199999999998,44.441400000000002,50.591999999999999,56.079599999999999,null,56,17.828399999999998,22.551000000000002,27.2226,33.679200000000002,46.031400000000005,52.182000000000002,57.669600000000003]
[57,16.442399999999999,21.246599999999997,26.020200000000003,32.629799999999996,45.196200000000005,51.469200000000001,57.069000000000003,null,57,18.032399999999999,22.836599999999997,27.610200000000003,34.219799999999999,46.786200000000008,53.059200000000004,58.659000000000006]
[58,16.687200000000001,21.562799999999999,26.367000000000001,33.109200000000001,45.930599999999998,52.448399999999999,57.956400000000002,null,58,18.277200000000001,23.152799999999999,27.957000000000001,34.699200000000005,47.520600000000002,54.038400000000003,59.546400000000006]
[59,16.9422,21.858599999999999,26.774999999999999,33.568199999999997,46.736400000000003,53.366399999999999,59.047800000000002,null,59,18.5322,23.448599999999999,28.364999999999998,35.158200000000001,48.326400000000007,54.956400000000002,60.637800000000006]
[60,17.115600000000001,22.174799999999998,27.091199999999997,34.159800000000004,47.542200000000001,54.182399999999994,60.098400000000005,null,60,18.7056,23.764799999999997,28.681199999999997,35.749800000000008,49.132200000000005,55.772399999999998,61.688400000000009]
[61,17.380800000000001,22.572599999999998,27.499200000000002,34.751400000000004,48.358199999999997,55.069800000000001,61.087800000000001,null,61,18.970800000000001,24.162599999999998,29.089200000000002,36.341400000000007,49.9482,56.659800000000004,62.677800000000005]
[62,17.5746,22.980600000000003,27.988800000000001,35.271599999999999,49.174199999999999,56.0184,62.117999999999995,null,62,19.1646,24.570600000000002,29.578800000000001,36.861600000000003,50.764200000000002,57.608400000000003,63.707999999999998]
[63,17.850000000000001,23.204999999999998,28.356000000000002,35.802,49.98,56.905799999999999,63.107399999999998,null,63,19.440000000000001,24.794999999999998,29.946000000000002,37.392000000000003,51.57,58.495800000000003,64.697400000000002]
[64,18.084600000000002,23.510999999999999,28.825200000000002,36.240600000000001,50.836800000000004,57.844200000000001,64.117199999999997,null,64,19.674600000000002,25.100999999999999,30.415200000000002,37.830600000000004,52.426800000000007,59.434200000000004,65.7072]
[65,18.308999999999997,23.796599999999998,29.284200000000002,36.740400000000001,51.673199999999994,58.741800000000005,65.045400000000001,null,65,19.898999999999997,25.386599999999998,30.874200000000002,38.330400000000004,53.263199999999998,60.331800000000008,66.635400000000004]
[66,18.523199999999999,24.204599999999999,29.743200000000002,37.270800000000001,52.427999999999997,59.629199999999997,66.096000000000004,null,66,20.113199999999999,25.794599999999999,31.333200000000001,38.860800000000005,54.018000000000001,61.219200000000001,67.686000000000007]
[67,18.818999999999999,24.490200000000002,30.038999999999998,37.790999999999997,53.244,60.536999999999999,67.146599999999992,null,67,20.408999999999999,26.080200000000001,31.628999999999998,39.381,54.834000000000003,62.127000000000002,68.736599999999996]
[68,19.043400000000002,24.847200000000001,30.447000000000003,38.290799999999997,53.957999999999998,61.454999999999998,68.1768,null,68,20.633400000000002,26.437200000000001,32.037000000000006,39.880800000000001,55.548000000000002,63.045000000000002,69.766800000000003]
[69,19.298400000000001,25.1736,30.844799999999999,38.800800000000002,54.702600000000004,62.342399999999998,69.206999999999994,null,69,20.888400000000001,26.7636,32.434800000000003,40.390800000000006,56.292600000000007,63.932400000000001,70.796999999999997]
[70,19.512599999999999,25.510200000000001,31.252800000000001,39.290400000000005,55.488,63.199199999999998,70.329000000000008,null,70,21.102599999999999,27.100200000000001,32.842800000000004,40.880400000000009,57.078000000000003,64.789199999999994,71.919000000000011]
[71,19.706399999999999,25.724399999999999,31.7424,39.6678,56.1,63.943799999999996,71.400000000000006,null,71,21.296399999999998,27.314399999999999,33.3324,41.257800000000003,57.690000000000005,65.533799999999999,72.990000000000009]
[72,20.022600000000001,25.989599999999999,32.283000000000001,40.187999999999995,56.905799999999999,64.8108,72.430199999999999,null,72,21.6126,27.579599999999999,33.873000000000005,41.777999999999999,58.495800000000003,66.400800000000004,74.020200000000003]
[73,20.2776,26.367000000000001,32.813400000000001,40.687800000000003,57.680999999999997,65.759399999999999,73.480800000000002,null,73,21.867599999999999,27.957000000000001,34.403400000000005,42.277800000000006,59.271000000000001,67.349400000000003,75.070800000000006]
[74,20.552999999999997,26.683199999999999,33.313199999999995,41.2896,58.4358,66.667199999999994,74.5518,null,74,22.142999999999997,28.273199999999999,34.903199999999998,42.879600000000003,60.025800000000004,68.257199999999997,76.141800000000003]
[75,20.808,26.999399999999998,33.8232,41.932200000000002,59.16,67.513800000000003,75.602400000000003,null,75,22.398,28.589399999999998,35.413200000000003,43.522200000000005,60.75,69.103800000000007,77.192400000000006]
[76,21.124200000000002,27.3462,34.333199999999998,42.544200000000004,59.924999999999997,68.380800000000008,76.673400000000001,null,76,22.714200000000002,28.936199999999999,35.923200000000001,44.134200000000007,61.515000000000001,69.970800000000011,78.263400000000004]
[77,21.4404,27.703199999999999,34.68,43.2684,60.6798,69.319199999999995,77.734199999999987,null,77,23.0304,29.293199999999999,36.270000000000003,44.858400000000003,62.269800000000004,70.909199999999998,79.32419999999999]
[78,21.695399999999999,28.070399999999999,35.139000000000003,43.900799999999997,61.363199999999999,70.22699999999999,78.733800000000002,null,78,23.285399999999999,29.660399999999999,36.729000000000006,45.4908,62.953200000000002,71.816999999999993,80.323800000000006]
[79,22.0014,28.509,35.577600000000004,44.441400000000002,62.138400000000004,71.114400000000003,79.76400000000001,null,79,23.5914,30.099,37.167600000000007,46.031400000000005,63.728400000000008,72.704400000000007,81.354000000000013]
[80,22.276800000000001,28.968,36.006,44.971800000000002,62.913600000000002,71.991600000000005,80.814599999999999,null,80,23.866800000000001,30.558,37.596000000000004,46.561800000000005,64.503600000000006,73.581600000000009,82.404600000000002]
[81,22.593,29.447400000000002,36.393599999999999,45.471599999999995,63.699000000000005,72.889199999999988,81.712199999999996,null,81,24.183,31.037400000000002,37.983600000000003,47.061599999999999,65.289000000000001,74.479199999999992,83.302199999999999]
[82,22.8888,29.835000000000001,36.740400000000001,46.063199999999995,64.402799999999999,73.796999999999997,82.813800000000001,null,82,24.4788,31.425000000000001,38.330400000000004,47.653199999999998,65.992800000000003,75.387,84.403800000000004]
[83,23.1846,30.151199999999999,37.179000000000002,46.685400000000001,65.188199999999995,74.694600000000008,83.864400000000003,null,83,24.7746,31.741199999999999,38.769000000000005,48.275400000000005,66.778199999999998,76.284600000000012,85.454400000000007]
[84,23.46,30.4878,37.627800000000001,47.124000000000002,65.963400000000007,75.63300000000001,84.843600000000009,null,84,25.05,32.077800000000003,39.217800000000004,48.714000000000006,67.553400000000011,77.223000000000013,86.433600000000013]
[85,23.796599999999998,30.906000000000002,38.025600000000004,47.715600000000002,66.687599999999989,76.489799999999988,85.822800000000001,null,85,25.386599999999998,32.496000000000002,39.615600000000008,49.305600000000005,68.277599999999993,78.079799999999992,87.412800000000004]
[86,24.051599999999997,31.252800000000001,38.413199999999996,48.195,67.472999999999999,77.407799999999995,86.883600000000001,null,86,25.641599999999997,32.842800000000004,40.0032,49.785000000000004,69.063000000000002,78.997799999999998,88.473600000000005]
[87,24.235200000000003,31.589399999999998,38.923199999999994,48.7254,68.197199999999995,78.376800000000003,87.903600000000012,null,87,25.825200000000002,33.179400000000001,40.513199999999998,50.315400000000004,69.787199999999999,79.966800000000006,89.493600000000015]
[88,24.490200000000002,31.956599999999998,39.382199999999997,49.337399999999995,68.788799999999995,79.213200000000001,88.9542,null,88,26.080200000000001,33.546599999999998,40.972200000000001,50.927399999999999,70.378799999999998,80.803200000000004,90.544200000000004]
[89,24.796199999999999,32.333999999999996,39.800400000000003,49.929000000000002,69.57419999999999,80.161799999999999,89.892600000000002,null,89,26.386199999999999,33.923999999999999,41.390400000000007,51.519000000000005,71.164199999999994,81.751800000000003,91.482600000000005]
[90,25.061399999999999,32.650199999999998,40.187999999999995,50.4084,70.349400000000003,80.998199999999997,90.871800000000007,null,90,26.651399999999999,34.240200000000002,41.777999999999999,51.998400000000004,71.939400000000006,82.588200000000001,92.461800000000011]
[91,25.326599999999999,33.007199999999997,40.606200000000001,50.9694,71.094000000000008,81.875399999999999,91.92240000000001,null,91,26.916599999999999,34.597200000000001,42.196200000000005,52.559400000000004,72.684000000000012,83.465400000000002,93.512400000000014]
[92,25.6326,33.384599999999999,40.9938,51.622199999999999,71.797799999999995,82.813800000000001,92.942400000000006,null,92,27.2226,34.974600000000002,42.583800000000004,53.212200000000003,73.387799999999999,84.403800000000004,94.53240000000001]
[93,25.907999999999998,33.700800000000001,41.340600000000002,52.111800000000002,72.521999999999991,83.711399999999998,93.890999999999991,null,93,27.497999999999998,35.290800000000004,42.930600000000005,53.701800000000006,74.111999999999995,85.301400000000001,95.480999999999995]
[94,26.152799999999999,34.0884,41.677199999999999,52.672800000000002,73.297200000000004,84.588600000000014,94.931399999999996,null,94,27.742799999999999,35.678400000000003,43.267200000000003,54.262800000000006,74.887200000000007,86.178600000000017,96.5214]
[95,26.448599999999999,34.435199999999995,42.013799999999996,53.162399999999998,74.011200000000002,85.496399999999994,95.961600000000004,null,95,28.038599999999999,36.025199999999998,43.6038,54.752400000000002,75.601200000000006,87.086399999999998,97.551600000000008]
[96,26.724,34.792200000000001,42.432000000000002,53.682600000000001,74.765999999999991,86.444999999999993,96.9816,null,96,28.314,36.382200000000005,44.022000000000006,55.272600000000004,76.355999999999995,88.034999999999997,98.571600000000004]
[97,26.999399999999998,35.139000000000003,42.738,54.233400000000003,75.602400000000003,87.34259999999999,97.991399999999999,null,97,28.589399999999998,36.729000000000006,44.328000000000003,55.823400000000007,77.192400000000006,88.932599999999994,99.581400000000002]
[98,27.274799999999999,35.516399999999997,43.044000000000004,54.702600000000004,76.428600000000003,88.250399999999999,99.011399999999995,null,98,28.864799999999999,37.106400000000001,44.634000000000007,56.292600000000007,78.018600000000006,89.840400000000002,100.6014]
[99,27.529799999999998,35.863199999999999,43.482600000000005,55.314599999999999,77.111999999999995,89.168400000000005,100.00080000000001,null,99,29.119799999999998,37.453200000000002,45.072600000000008,56.904600000000002,78.701999999999998,90.758400000000009,101.59080000000002]
[100,27.835799999999999,36.189599999999999,43.788600000000002,55.732799999999997,77.938199999999995,89.963999999999999,100.9902,null,100,29.425799999999999,37.779600000000002,45.378600000000006,57.322800000000001,79.528199999999998,91.554000000000002,102.5802]
[101,28.05,36.556800000000003,44.135400000000004,56.232600000000005,78.733800000000002,90.851399999999998,101.9796,null,101,29.64,38.146800000000006,45.725400000000008,57.822600000000008,80.323800000000006,92.441400000000002,103.56960000000001]
[102,28.3764,36.975000000000001,44.472000000000001,56.691600000000001,79.447800000000001,91.769400000000005,103.0098,null,102,29.9664,38.565000000000005,46.062000000000005,58.281600000000005,81.037800000000004,93.359400000000008,104.5998]
[103,28.621199999999998,37.311599999999999,44.839199999999998,57.150600000000004,80.243400000000008,92.666999999999987,103.99919999999999,null,103,30.211199999999998,38.901600000000002,46.429200000000002,58.740600000000008,81.833400000000012,94.256999999999991,105.58919999999999]
[104,28.927199999999999,37.648199999999996,45.196200000000005,57.711599999999997,81.018600000000006,93.554400000000001,105.0804,null,104,30.517199999999999,39.238199999999999,46.786200000000008,59.301600000000001,82.60860000000001,95.144400000000005,106.6704]
[105,29.121000000000002,37.974599999999995,45.542999999999999,58.160400000000003,81.855000000000004,94.492800000000003,106.03919999999999,null,105,30.711000000000002,39.564599999999999,47.133000000000003,59.750400000000006,83.445000000000007,96.082800000000006,107.6292]
[106,29.427000000000003,38.392800000000001,45.930599999999998,58.690799999999996,82.558799999999991,95.410800000000009,107.02860000000001,null,106,31.017000000000003,39.982800000000005,47.520600000000002,60.280799999999999,84.148799999999994,97.000800000000012,108.61860000000001]
[107,29.722799999999999,38.698799999999999,46.2774,59.180400000000006,83.4054,96.247199999999992,108.09960000000001,null,107,31.312799999999999,40.288800000000002,47.867400000000004,60.770400000000009,84.995400000000004,97.837199999999996,109.68960000000001]
[108,30.038999999999998,39.0456,46.6038,59.680199999999999,84.180599999999998,97.185600000000008,109.0074,null,108,31.628999999999998,40.635600000000004,48.193800000000003,61.270200000000003,85.770600000000002,98.775600000000011,110.59740000000001]
[109,30.232800000000001,39.443400000000004,47.083199999999998,60.1494,85.006799999999998,98.124000000000009,110.05800000000001,null,109,31.822800000000001,41.033400000000007,48.673200000000001,61.739400000000003,86.596800000000002,99.714000000000013,111.64800000000001]
[110,30.4878,39.749400000000001,47.501400000000004,60.557399999999994,85.639199999999988,98.950200000000009,111.0882,null,110,32.077800000000003,41.339400000000005,49.091400000000007,62.147399999999998,87.229199999999992,100.54020000000001,112.6782]
[111,30.844799999999999,40.147199999999998,47.889000000000003,61.057200000000002,86.414400000000001,99.868200000000002,112.1388,null,111,32.434800000000003,41.737200000000001,49.479000000000006,62.647200000000005,88.004400000000004,101.45820000000001,113.72880000000001]
[112,31.120200000000001,40.534800000000004,48.358199999999997,61.618199999999995,87.291600000000003,100.7556,113.0772,null,112,32.7102,42.124800000000008,49.9482,63.208199999999998,88.881600000000006,102.3456,114.66720000000001]
[113,31.3446,40.881599999999999,48.766200000000005,62.169000000000004,88.015800000000013,101.67360000000001,114.0564,null,113,32.934600000000003,42.471600000000002,50.356200000000008,63.759000000000007,89.605800000000016,103.26360000000001,115.6464]
[114,31.589399999999998,41.177399999999999,49.194599999999994,62.8626,88.770600000000002,102.58139999999999,115.107,null,114,33.179400000000001,42.767400000000002,50.784599999999998,64.452600000000004,90.360600000000005,104.17139999999999,116.697]
[115,31.915800000000001,41.5242,49.653599999999997,63.474599999999995,89.5458,103.4892,116.06580000000001,null,115,33.505800000000001,43.114200000000004,51.243600000000001,65.064599999999999,91.135800000000003,105.0792,117.65580000000001]
[116,32.1402,41.932200000000002,50.051400000000001,64.086600000000004,90.372,104.3664,117.14699999999999,null,116,33.730200000000004,43.522200000000005,51.641400000000004,65.676600000000008,91.962000000000003,105.9564,118.73699999999999]
[117,32.436,42.228000000000002,50.387999999999998,64.515000000000001,91.177800000000005,105.27419999999999,118.19759999999999,null,117,34.026000000000003,43.818000000000005,51.978000000000002,66.105000000000004,92.767800000000008,106.8642,119.7876]
[118,32.711399999999998,42.564599999999999,50.857199999999999,65.065799999999996,91.92240000000001,106.2432,119.1666,null,118,34.301400000000001,44.154600000000002,52.447200000000002,66.655799999999999,93.512400000000014,107.83320000000001,120.75660000000001]
[119,33.007199999999997,42.982799999999997,51.2958,65.596199999999996,92.758799999999994,107.11020000000001,120.17639999999999,null,119,34.597200000000001,44.572800000000001,52.885800000000003,67.186199999999999,94.348799999999997,108.70020000000001,121.76639999999999]
[120,33.241800000000005,43.35,51.775199999999998,66.024600000000007,93.513600000000011,107.9568,121.125,null,120,34.831800000000008,44.940000000000005,53.365200000000002,67.61460000000001,95.103600000000014,109.5468,122.715]
[121,33.537600000000005,43.676400000000001,52.173000000000002,66.667199999999994,94.2072,108.87479999999999,122.15520000000001,null,121,35.127600000000008,45.266400000000004,53.763000000000005,68.257199999999997,95.797200000000004,110.4648,123.74520000000001]
[122,33.8232,44.074199999999998,52.570799999999998,67.146599999999992,95.002800000000008,109.7826,123.2466,null,122,35.413200000000003,45.664200000000001,54.160800000000002,68.736599999999996,96.592800000000011,111.37260000000001,124.8366]
[123,34.067999999999998,44.400600000000004,53.04,67.717799999999997,95.890200000000007,110.6088,124.21559999999999,null,123,35.658000000000001,45.990600000000008,54.63,69.3078,97.480200000000011,112.19880000000001,125.8056]
[124,34.333199999999998,44.737200000000001,53.458199999999998,68.197199999999995,96.644999999999996,111.5472,125.21520000000001,null,124,35.923200000000001,46.327200000000005,55.048200000000001,69.787199999999999,98.234999999999999,113.13720000000001,126.80520000000001]
[125,34.639200000000002,45.084000000000003,53.845799999999997,68.676599999999993,97.348799999999997,112.4346,126.22499999999999,null,125,36.229200000000006,46.674000000000007,55.4358,70.266599999999997,98.938800000000001,114.02460000000001,127.815]
[126,34.904399999999995,45.492000000000004,54.294599999999996,69.227400000000003,98.174999999999997,113.3322,127.1532,null,126,36.494399999999999,47.082000000000008,55.884599999999999,70.817400000000006,99.765000000000001,114.9222,128.7432]
[127,35.169599999999996,45.787799999999997,54.753599999999999,69.727199999999996,98.9298,114.2706,128.214,null,127,36.759599999999999,47.377800000000001,56.343600000000002,71.3172,100.5198,115.86060000000001,129.804]
[128,35.495999999999995,46.185600000000001,55.1616,70.267799999999994,99.674400000000006,115.158,129.24420000000001,null,128,37.085999999999999,47.775600000000004,56.751600000000003,71.857799999999997,101.26440000000001,116.748,130.83420000000001]
[129,35.730600000000003,46.6038,55.579799999999999,70.767600000000002,100.5312,116.06580000000001,130.27439999999999,null,129,37.320600000000006,48.193800000000003,57.169800000000002,72.357600000000005,102.1212,117.65580000000001,131.86439999999999]
[130,36.0366,46.889400000000002,55.9878,71.247,101.3064,116.92259999999999,131.2842,null,130,37.626600000000003,48.479400000000005,57.577800000000003,72.837000000000003,102.8964,118.51259999999999,132.8742]
[131,36.220199999999998,47.256599999999999,56.426400000000001,71.859000000000009,102.10199999999999,117.85080000000001,132.31440000000001,null,131,37.810200000000002,48.846600000000002,58.016400000000004,73.449000000000012,103.69199999999999,119.44080000000001,133.90440000000001]
[132,36.485400000000006,47.654399999999995,56.8752,72.369,102.8772,118.72800000000001,133.24259999999998,null,132,38.075400000000009,49.244399999999999,58.465200000000003,73.959000000000003,104.46720000000001,120.31800000000001,134.83259999999999]
[133,36.8322,47.94,57.334200000000003,72.960599999999999,103.5912,119.646,134.24220000000003,null,133,38.422200000000004,49.53,58.924200000000006,74.550600000000003,105.1812,121.236,135.83220000000003]
[134,37.138199999999998,48.286800000000007,57.772800000000004,73.460399999999993,104.3664,120.5334,135.32339999999999,null,134,38.728200000000001,49.87680000000001,59.362800000000007,75.050399999999996,105.9564,122.1234,136.9134]
[135,37.332000000000001,48.623400000000004,58.231800000000007,73.980599999999995,105.1212,121.4718,136.28220000000002,null,135,38.922000000000004,50.213400000000007,59.82180000000001,75.570599999999999,106.71120000000001,123.06180000000001,137.87220000000002]
[136,37.607399999999998,49.041599999999995,58.599000000000004,74.500800000000012,105.9678,122.32860000000001,137.33279999999999,null,136,39.197400000000002,50.631599999999999,60.189000000000007,76.090800000000016,107.5578,123.91860000000001,138.9228]
[137,37.933799999999998,49.3782,59.047800000000002,75.051599999999993,106.74300000000001,123.267,138.33240000000001,null,137,39.523800000000001,50.968200000000003,60.637800000000006,76.641599999999997,108.33300000000001,124.857,139.92240000000001]
[138,38.199000000000005,49.725000000000001,59.486400000000003,75.602400000000003,107.50800000000001,124.16460000000001,139.3218,null,138,39.789000000000009,51.315000000000005,61.076400000000007,77.192400000000006,109.09800000000001,125.75460000000001,140.9118]
[139,38.433599999999998,50.132999999999996,59.904599999999995,76.153199999999998,108.324,125.0928,140.29079999999999,null,139,40.023600000000002,51.722999999999999,61.494599999999998,77.743200000000002,109.914,126.6828,141.88079999999999]
[140,38.698799999999999,50.428799999999995,60.363599999999998,76.714199999999991,109.0074,125.9496,141.321,null,140,40.288800000000002,52.018799999999999,61.953600000000002,78.304199999999994,110.59740000000001,127.53960000000001,142.911]
[141,38.964000000000006,50.775600000000004,60.771599999999999,77.224199999999996,109.80300000000001,126.82680000000001,142.392,null,141,40.554000000000009,52.365600000000008,62.361600000000003,78.8142,111.39300000000001,128.41679999999999,143.982]
[142,39.249599999999994,51.183599999999998,61.138799999999996,77.775000000000006,110.5578,127.755,143.35079999999999,null,142,40.839599999999997,52.773600000000002,62.7288,79.365000000000009,112.1478,129.345,144.9408]
[143,39.535199999999996,51.520199999999996,61.638599999999997,78.315600000000003,111.435,128.64240000000001,144.36060000000001,null,143,41.1252,53.110199999999999,63.2286,79.905600000000007,113.02500000000001,130.23240000000001,145.95060000000001]
[144,39.800400000000003,51.846599999999995,62.026200000000003,78.917400000000001,112.1592,129.54,145.40100000000001,null,144,41.390400000000007,53.436599999999999,63.616200000000006,80.507400000000004,113.7492,131.13,146.99100000000001]
[145,40.014599999999994,52.193400000000004,62.434200000000004,79.427400000000006,112.89360000000001,130.4478,146.33940000000001,null,145,41.604599999999998,53.783400000000007,64.024200000000008,81.017400000000009,114.48360000000001,132.0378,147.92940000000002]
[146,40.300199999999997,52.632000000000005,62.8626,79.927199999999999,113.7504,131.36579999999998,147.38999999999999,null,146,41.8902,54.222000000000008,64.452600000000004,81.517200000000003,115.3404,132.95579999999998,148.97999999999999]
[147,40.565400000000004,52.9482,63.352199999999996,80.518799999999999,114.5154,132.2328,148.42019999999999,null,147,42.155400000000007,54.538200000000003,64.9422,82.108800000000002,116.1054,133.8228,150.0102]
[148,40.779599999999995,53.284800000000004,63.760199999999998,81.049199999999999,115.26,133.19160000000002,149.37899999999999,null,148,42.369599999999998,54.874800000000008,65.350200000000001,82.639200000000002,116.85000000000001,134.78160000000003,150.96899999999999]
[149,41.065199999999997,53.682600000000001,64.158000000000001,81.569400000000002,116.08620000000001,134.04839999999999,150.37860000000001,null,149,42.655200000000001,55.272600000000004,65.748000000000005,83.159400000000005,117.67620000000001,135.63839999999999,151.96860000000001]
[150,40.590000000000003,52.96,63.3,80.510000000000005,114.59,132.24,148.43,null,150,43.77,56.14,66.48,83.69,117.76,135.42000000000002,151.61000000000001]

{"sheet":"GND E&I","index":11,"n_rows":160,"n_cols":8,"rows_kept":160,"cut":false,"hidden":true,"merged":[[6,0,6,15]]}
[]
[]
[]
[]
[]
[]
["FedEx Continental U.S. Ground "]
["Weight","Packages Weighing 1-50 Pounds"]
["Not To","Continental U.S. Ground"]
["Exceed",2,3,4,5,6,7,8]
[1,6.36,6.36,6.36,6.36,6.36,6.36,6.36]
[2,6.36,6.36,6.36,6.36,6.36,6.36,6.36]
[3,6.36,6.36,6.36,6.36,6.36,6.42,6.79]
[4,6.36,6.36,6.36,6.36,6.5299999999999994,6.83,7.2700000000000005]
[5,6.36,6.36,6.36,6.58,6.74,7.09,7.629999999999999]
[6,6.36,6.36,6.36,6.36,6.36,6.36,6.69]
[7,6.36,6.36,6.36,6.36,6.36,6.43,6.88]
[8,6.36,6.36,6.36,6.36,6.36,6.629999999999999,7.1899999999999995]
[9,6.36,6.36,6.36,6.36,6.37,6.8999999999999995,7.64]
[10,6.36,6.36,6.36,6.36,6.629999999999999,7.3699999999999992,8.14]
[11,6.36,6.36,6.36,6.36,6.36,7.21,7.9099999999999993]
[12,6.36,6.36,6.36,6.36,6.41,7.5699999999999994,8.36]
[13,6.36,6.36,6.36,6.36,6.67,8.0399999999999991,8.9]
[14,6.36,6.36,6.36,6.36,6.98,8.5400000000000009,9.42]
[15,6.36,6.36,6.36,6.36,7.3,8.8800000000000008,9.89]
[16,6.36,6.36,6.36,6.44,7.54,9.259999999999998,10.189999999999998]
[17,6.36,6.36,6.36,6.6800000000000006,7.9300000000000006,9.7300000000000022,10.68]
[18,6.36,6.36,6.36,7.01,8.25,10.029999999999999,11.200000000000001]
[19,6.36,6.36,6.36,7.14,8.5199999999999978,10.340000000000002,11.61]
[20,6.36,6.36,6.36,7.5000000000000009,8.8999999999999986,10.729999999999999,12.15]
[21,6.36,6.3800000000000008,6.5399999999999991,7.6499999999999995,9.26,11.129999999999999,12.64]
[22,6.36,6.4999999999999991,6.78,8.0100000000000016,9.6399999999999988,11.54,13.190000000000001]
[23,6.36,6.669999999999999,6.99,8.240000000000002,10,11.92,13.719999999999999]
[24,6.36,6.82,7.22,8.5,10.38,12.33,14.260000000000002]
[25,6.36,6.9,7.31,8.75,10.74,12.72,14.79]
[26,6.36,7.14,7.6099999999999994,9.0200000000000014,11.14,13.27,15.280000000000001]
[27,6.36,7.31,7.6899999999999995,9.1599999999999984,11.5,13.51,15.81]
[28,6.4599999999999991,7.4899999999999993,8.0500000000000007,9.5799999999999983,12.040000000000001,14.090000000000002,16.350000000000001]
[29,6.5900000000000007,7.620000000000001,8.2800000000000011,9.7999999999999989,12.379999999999999,14.430000000000001,16.84]
[30,6.66,7.81,8.5199999999999978,10.1,12.58,14.610000000000001,17.380000000000003]
[31,6.7599999999999989,7.85,8.56,10.160000000000002,12.839999999999998,14.919999999999998,17.790000000000003]
[32,6.7600000000000007,7.9499999999999993,8.7900000000000009,10.439999999999998,13.21,15.330000000000002,18.32]
[33,6.88,8.1999999999999993,9.09,10.829999999999998,13.56,15.729999999999999,18.819999999999997]
[34,6.92,8.2999999999999989,9.2900000000000009,11,13.940000000000001,16.149999999999999,19.349999999999998]
[35,7.04,8.5800000000000018,9.51,11.26,14.28,16.560000000000002,19.86]
[36,7.14,8.67,9.6799999999999979,11.650000000000002,14.64,16.97,20.250000000000004]
[37,7.33,8.86,9.8699999999999992,11.910000000000002,14.96,17.339999999999996,20.65]
[38,7.43,8.9999999999999982,10.09,12.200000000000001,15.290000000000001,17.749999999999996,21.03]
[39,7.54,9.1800000000000015,10.319999999999999,12.33,15.68,18.23,21.459999999999997]
[40,7.55,9.3000000000000007,10.439999999999998,12.59,16,18.619999999999997,21.82]
[41,7.6499999999999995,9.52,10.729999999999999,12.83,16.36,19.02,22.07]
[42,7.77,9.64,10.930000000000001,13.07,16.75,19.520000000000003,22.39]
[43,7.8699999999999992,9.6999999999999993,11.05,13.469999999999999,17.159999999999997,20.04,22.78]
[44,8.0500000000000007,9.9699999999999989,11.35,13.719999999999999,17.47,20.469999999999995,23.02]
[45,8.0500000000000007,10.119999999999999,11.549999999999999,13.99,17.759999999999998,20.870000000000005,23.41]
[46,8.16,10.130000000000001,11.7,14.110000000000001,18.060000000000002,21.290000000000003,23.799999999999997]
[47,8.2200000000000006,10.26,11.889999999999999,14.35,18.3,21.709999999999997,24.179999999999996]
[48,8.2199999999999989,10.309999999999999,12.04,14.589999999999998,18.579999999999998,22.12,24.569999999999997]
[49,8.240000000000002,10.31,12.09,14.84,18.810000000000002,22.509999999999998,24.939999999999998]
[50,8.2800000000000011,10.37,12.219999999999999,14.889999999999999,18.87,22.569999999999997,25.32]
[51,8.2799999999999994,10.370000000000001,12.3,14.89,18.88,22.570000000000004,25.33]
[52,8.2900000000000009,10.379999999999999,12.39,15.08,18.880000000000003,22.580000000000002,25.349999999999998]
[53,8.2899999999999991,10.38,12.389999999999999,15.08,18.89,22.63,25.720000000000002]
[54,8.3000000000000007,10.39,12.4,15.280000000000001,18.889999999999997,22.71,26.050000000000004]
[55,8.36,10.46,12.44,15.500000000000002,18.899999999999995,22.78,26.349999999999998]
[56,8.4200000000000017,10.559999999999999,12.549999999999999,15.719999999999999,18.900000000000002,22.82,26.68]
[57,8.61,10.74,12.579999999999998,15.940000000000001,19.04,22.9,26.959999999999997]
[58,8.6199999999999974,10.749999999999998,12.700000000000001,16.11,19.25,22.960000000000004,27.18]
[59,8.69,10.85,12.760000000000002,16.27,19.429999999999996,23.08,27.38]
[60,8.7800000000000011,10.959999999999999,12.950000000000001,16.39,19.599999999999998,23.2,27.55]
[61,8.86,11.19,12.959999999999999,16.57,19.78,23.34,27.71]
[62,9.1000000000000014,11.650000000000002,13.060000000000002,16.72,19.91,23.48,27.880000000000003]
[63,9.14,11.66,13.07,16.829999999999998,20.04,23.62,28.05]
[64,9.3000000000000007,11.88,13.4,17.049999999999997,20.180000000000003,23.78,28.21]
[65,9.4899999999999984,12.11,13.410000000000002,17.05,20.36,23.909999999999997,28.389999999999997]
[66,9.629999999999999,12.32,13.429999999999998,17.150000000000002,20.57,24.03,28.6]
[67,9.75,12.450000000000001,13.7,17.180000000000003,20.729999999999997,24.149999999999995,28.659999999999997]
[68,9.8400000000000016,12.680000000000001,14.22,17.330000000000002,20.84,24.28,28.73]
[69,9.89,12.68,14.229999999999999,17.600000000000001,20.950000000000003,24.399999999999995,28.810000000000002]
[70,9.9200000000000017,12.7,14.54,17.820000000000004,21.369999999999997,24.49,29.06]
[71,9.9400000000000013,12.940000000000001,14.77,18.039999999999996,21.7,24.909999999999997,29.119999999999997]
[72,10.18,12.95,14.97,18.269999999999996,21.87,25.490000000000002,29.189999999999998]
[73,10.54,12.950000000000001,15.169999999999998,18.509999999999998,22.1,25.88,29.269999999999996]
[74,11.020000000000001,12.989999999999998,15.37,18.750000000000004,22.450000000000003,26.28,29.38]
[75,11.43,13.360000000000001,15.420000000000002,19.07,22.87,26.540000000000003,29.45]
[76,11.860000000000001,13.850000000000001,15.47,19.380000000000003,23.159999999999997,26.979999999999997,29.6]
[77,12.319999999999999,14.170000000000002,15.77,19.619999999999997,23.3,27.49,29.649999999999995]
[78,12.700000000000001,14.44,16.11,19.84,23.430000000000003,27.950000000000003,29.68]
[79,13.140000000000002,15.04,16.519999999999996,20.150000000000002,23.919999999999998,28.109999999999996,29.890000000000004]
[80,13.500000000000002,15.47,16.910000000000004,20.43,24.33,28.509999999999998,30.110000000000003]
[81,13.81,15.739999999999998,17.3,20.58,24.650000000000002,28.94,30.200000000000003]
[82,14.27,16.100000000000001,17.690000000000001,20.96,24.700000000000003,29.29,30.339999999999996]
[83,14.68,16.430000000000003,18.080000000000002,21.109999999999996,25.01,29.69,30.689999999999998]
[84,15.12,16.82,18.450000000000003,21.509999999999998,25.38,30.060000000000002,31.04]
[85,15.529999999999998,17.239999999999998,18.799999999999997,21.86,25.78,30.38,31.380000000000003]
[86,15.96,17.63,19.18,22.129999999999995,26.090000000000003,30.65,31.73]
[87,16.419999999999998,18.039999999999996,19.610000000000003,22.209999999999997,26.419999999999998,30.969999999999995,32.08]
[88,16.940000000000005,18.450000000000003,19.980000000000004,22.549999999999997,26.77,31.29,32.430000000000007]
[89,17.53,18.78,20.36,22.910000000000004,27.11,31.610000000000003,32.790000000000006]
[90,18.099999999999998,19.09,20.66,23.06,27.229999999999997,31.67,33.129999999999995]
[91,18.399999999999999,19.409999999999997,21.060000000000002,23.299999999999997,27.52,31.74,33.480000000000004]
[92,18.839999999999996,19.78,21.37,23.65,27.869999999999997,31.880000000000003,33.85]
[93,19.29,20.159999999999997,21.779999999999998,23.979999999999997,28.089999999999996,32,34.19]
[94,19.740000000000002,20.530000000000005,22.09,24.29,28.419999999999998,32.06,34.550000000000004]
[95,20.2,20.869999999999997,22.430000000000003,24.61,28.610000000000003,32.17,34.909999999999997]
[96,20.650000000000002,21.220000000000002,22.8,24.89,28.770000000000003,32.35,35.249999999999993]
[97,21.130000000000003,21.630000000000003,23.159999999999997,25.28,29.12,32.400000000000006,35.61]
[98,21.61,21.98,23.600000000000005,25.58,29.450000000000003,32.64,35.97]
[99,22.09,22.33,24.049999999999997,25.900000000000002,29.79,32.97,36.330000000000005]
[100,22.499999999999996,22.69,24.490000000000002,26.290000000000003,30.12,33.300000000000011,36.68]
[101,22.84,23.009999999999998,24.889999999999997,26.61,30.380000000000003,33.56,36.960000000000008]
[102,23.080000000000002,23.359999999999996,25.18,26.959999999999997,30.69,33.86,37.309999999999995]
[103,23.48,23.72,25.49,27.220000000000002,30.979999999999997,34.159999999999997,37.639999999999993]
[104,23.849999999999998,24.060000000000002,25.790000000000003,27.51,31.27,34.450000000000003,37.999999999999993]
[105,24.240000000000002,24.42,26.090000000000003,27.799999999999997,31.569999999999997,34.749999999999993,38.319999999999993]
[106,24.639999999999997,24.789999999999996,26.39,28.080000000000002,31.859999999999996,35.06,38.680000000000007]
[107,25,25.16,26.69,28.369999999999997,32.15,35.370000000000005,39.019999999999996]
[108,25.36,25.520000000000003,26.99,28.650000000000002,32.449999999999996,35.68,39.369999999999997]
[109,25.720000000000002,25.87,27.289999999999996,28.940000000000005,32.730000000000004,35.980000000000004,39.72]
[110,26.04,26.250000000000004,27.599999999999998,29.21,33.049999999999997,36.309999999999995,40.06]
[111,26.330000000000002,26.540000000000003,27.909999999999997,29.499999999999996,33.33,36.61,40.499999999999993]
[112,26.61,26.83,28.21,29.79,33.610000000000007,36.930000000000007,40.93]
[113,26.86,27.12,28.520000000000003,30.06,33.909999999999997,37.229999999999997,41.28]
[114,27.18,27.419999999999998,28.84,30.35,34.21,37.529999999999994,41.620000000000005]
[115,27.47,27.72,29.160000000000004,30.64,34.479999999999997,37.850000000000009,41.949999999999996]
[116,27.76,28.1,29.46,30.869999999999997,34.72,38.08,42.21]
[117,28.04,28.400000000000002,29.76,31.16,35.010000000000005,38.379999999999995,42.56]
[118,28.33,28.699999999999996,30.08,31.439999999999998,35.290000000000006,38.689999999999991,42.889999999999993]
[119,28.629999999999995,29,30.39,31.709999999999997,35.58,39,43.44]
[120,29.12,29.299999999999997,30.7,32.010000000000005,35.879999999999995,39.309999999999995,43.79]
[121,29.44,29.55,31.02,32.24,36.11,39.519999999999996,44.04]
[122,29.639999999999997,29.710000000000004,31.33,32.519999999999996,36.389999999999993,39.830000000000005,44.4]
[123,29.950000000000003,30.029999999999998,31.65,32.799999999999997,36.669999999999995,40.140000000000008,44.75]
[124,30.229999999999997,30.32,31.98,33.1,36.979999999999997,40.440000000000005,45.09]
[125,30.54,30.619999999999997,32.300000000000004,33.380000000000003,37.26,40.739999999999995,45.430000000000007]
[126,30.840000000000003,30.910000000000004,32.620000000000005,33.599999999999994,37.47,40.970000000000006,45.709999999999994]
[127,31.119999999999997,31.23,32.940000000000005,33.89,37.76,41.269999999999996,46.029999999999994]
[128,31.439999999999998,31.45,33.26,34.180000000000007,38.04,41.56,46.39]
[129,31.740000000000002,31.749999999999996,33.580000000000005,34.480000000000004,38.330000000000005,41.860000000000007,46.74]
[130,32.04,32.06,33.89,34.74,38.620000000000005,42.16,47.089999999999996]
[131,32.340000000000003,32.369999999999997,34.229999999999997,34.979999999999997,38.830000000000005,42.390000000000008,47.56]
[132,32.650000000000006,32.690000000000005,34.550000000000004,35.269999999999996,39.120000000000005,42.68,47.900000000000006]
[133,32.960000000000008,33,34.880000000000003,35.550000000000004,39.39,42.980000000000004,48.249999999999993]
[134,33.25,33.300000000000011,35.220000000000006,35.849999999999994,39.700000000000003,43.269999999999996,48.61]
[135,33.510000000000005,33.63000000000001,35.54,36.149999999999991,40.019999999999996,43.600000000000009,48.95]
[136,33.789999999999992,33.94,35.879999999999995,36.450000000000003,40.340000000000003,43.91,49.31]
[137,34.079999999999991,34.260000000000005,36.21,36.719999999999992,40.569999999999993,44.19,49.650000000000006]
[138,34.400000000000006,34.580000000000005,36.559999999999995,37.059999999999995,40.97,44.550000000000004,50]
[139,34.700000000000003,34.93,36.899999999999991,37.369999999999997,41.29,44.86,50.359999999999992]
[140,35.020000000000003,35.260000000000005,37.25,37.680000000000007,41.620000000000005,45.17,50.7]
[141,35.319999999999993,35.590000000000003,37.61,37.97,41.86,45.4,50.949999999999996]
[142,35.460000000000008,35.93,37.950000000000003,38.279999999999994,42.16,45.71,51.290000000000006]
[143,35.779999999999994,36.25,38.300000000000004,38.590000000000003,42.489999999999995,46.029999999999994,51.650000000000006]
[144,36.1,36.589999999999996,38.660000000000004,38.9,42.81,46.349999999999994,51.989999999999995]
[145,36.219999999999992,36.940000000000005,39.010000000000005,39.21,43.129999999999995,46.650000000000006,52.34]
[146,36.529999999999994,37.26,39.359999999999992,39.510000000000005,43.45,46.96,52.669999999999995]
[147,36.840000000000003,37.61,39.74,39.830000000000005,43.76,47.279999999999994,53.03]
[148,37.069999999999993,37.94,40.08,40.15,44.089999999999996,47.6,53.389999999999993]
[149,37.28,38.29,40.44,40.450000000000003,44.410000000000004,47.900000000000006,53.989999999999995]
[150,37.600000000000009,38.630000000000003,41.110000000000007,41.800000000000004,44.74,48.230000000000004,54.339999999999996]

{"sheet":"PO E&I","index":12,"n_rows":150,"n_cols":16,"rows_kept":150,"cut":false,"hidden":true,"merged":[]}
[" FedEx Priority Overnight"]
["E&I Contract Zone Rates"]
[null,"Guaranteed delivery by 10:30 a.m. by Next Day"]
[]
["LBS",2,3,4,5,6,7,8,9,10,11,12,13,14,15,16]
[0.5,8.509999999999998,8.509999999999998,8.86,9.4399999999999977,9.4500000000000028,10.640000000000004,10.819999999999997,12.369999999999997,12.369999999999997,13.670000000000002,13.670000000000002,8.509999999999998,8.509999999999998,8.509999999999998,8.509999999999998]
["PAK1",8.870000000000001,10.220000000000002,13.370000000000001,14.830000000000005,15.620000000000005,17.229999999999997,17.699999999999996,19.459999999999994,19.459999999999994,19.649999999999999,19.649999999999999,12.540000000000003,12.540000000000003,12.540000000000003,12.540000000000003]
["PAK2",8.870000000000001,11.129999999999999,14.600000000000001,15.93,17.669999999999995,18.409999999999997,19.770000000000003,21.340000000000003,21.340000000000003,21.57,21.57,13.360000000000003,13.360000000000003,13.360000000000003,13.360000000000003]
[1,8.870000000000001,10.220000000000002,13.370000000000001,14.830000000000005,15.620000000000005,17.229999999999997,17.699999999999996,19.459999999999994,19.459999999999994,19.649999999999999,19.649999999999999,12.540000000000003,12.540000000000003,12.540000000000003,12.540000000000003]
[2,8.870000000000001,11.129999999999999,14.600000000000001,15.93,17.669999999999995,18.409999999999997,19.770000000000003,21.340000000000003,21.340000000000003,21.57,21.57,13.360000000000003,13.360000000000003,13.360000000000003,13.360000000000003]
[3,8.870000000000001,11.82,16.160000000000004,18.200000000000003,19.579999999999998,20.880000000000003,21.620000000000005,23.819999999999993,23.819999999999993,27.61,27.61,14.830000000000005,14.830000000000005,14.830000000000005,14.830000000000005]
[4,9.16,12.459999999999997,18.080000000000005,19.93,21.390000000000008,22.720000000000006,23.58,26,26,29.900000000000006,29.900000000000006,16.43,16.43,16.43,16.43]
[5,9.3099999999999987,12.899999999999999,18.729999999999997,20.639999999999993,22.210000000000008,23.340000000000003,24.220000000000006,28.150000000000006,28.150000000000006,32.049999999999997,32.049999999999997,17.850000000000001,17.850000000000001,17.850000000000001,17.850000000000001]
[6,10.579999999999998,13.64,20.759999999999998,23.519999999999996,24.6,26.36,27.5,30.190000000000012,30.190000000000012,34.289999999999992,34.289999999999992,19.669999999999995,19.669999999999995,19.669999999999995,19.669999999999995]
[7,10.729999999999997,14.409999999999997,21.690000000000005,24.67,26.340000000000003,27.509999999999991,29.370000000000005,32.180000000000007,32.180000000000007,36.540000000000006,36.540000000000006,20.740000000000002,20.740000000000002,20.740000000000002,20.740000000000002]
[8,10.82,15.100000000000001,23.079999999999991,26.88000000000001,28.689999999999998,29.14,30.290000000000006,34.129999999999995,34.129999999999995,38.249999999999986,38.249999999999986,24.189999999999998,24.189999999999998,24.189999999999998,24.189999999999998]
[9,10.96,15.14,24.950000000000003,27.980000000000004,29.180000000000007,31.38000000000001,32.299999999999997,36.33,36.33,40.589999999999989,40.589999999999989,24.730000000000004,24.730000000000004,24.730000000000004,24.730000000000004]
[10,11.010000000000002,15.189999999999998,25.470000000000006,28.260000000000005,29.560000000000002,31.429999999999993,32.340000000000003,38.460000000000008,38.460000000000008,40.61999999999999,40.61999999999999,24.779999999999994,24.779999999999994,24.779999999999994,24.779999999999994]
[11,12.48,17.329999999999998,28.899999999999991,32.650000000000006,35.06,37.339999999999989,38.210000000000008,40.61999999999999,40.61999999999999,44.660000000000011,44.660000000000011,27.42,27.42,27.42,27.42]
[12,13,17.89,29.549999999999997,34.17,36.760000000000005,38.460000000000008,40.280000000000015,42.600000000000009,42.600000000000009,45.639999999999986,45.639999999999986,30.330000000000013,30.330000000000013,30.330000000000013,30.330000000000013]
[13,13.18,18.57,30.209999999999994,35.730000000000004,38.249999999999986,40.480000000000004,42.209999999999994,44.72,44.72,46.88000000000001,46.88000000000001,31.460000000000008,31.460000000000008,31.460000000000008,31.460000000000008]
[14,13.400000000000002,19.019999999999996,32.53,36.72,38.919999999999987,41.359999999999985,42.909999999999982,46.730000000000004,46.730000000000004,48.149999999999991,48.149999999999991,31.5,31.5,31.5,31.5]
[15,13.450000000000003,19.060000000000002,32.950000000000003,36.760000000000005,38.959999999999994,41.410000000000011,42.949999999999989,48.17,48.17,49.320000000000007,49.320000000000007,31.540000000000006,31.540000000000006,31.540000000000006,31.540000000000006]
[16,13.990000000000002,20.699999999999996,35.239999999999995,40.19,41.699999999999989,44.749999999999986,45.650000000000006,50.069999999999993,50.069999999999993,51.399999999999991,51.399999999999991,35.840000000000003,35.840000000000003,35.840000000000003,35.840000000000003]
[17,15.04,21.340000000000003,36.260000000000005,41.429999999999993,43.569999999999993,45.290000000000006,46.669999999999987,51.179999999999993,51.179999999999993,52.819999999999993,52.819999999999993,35.89,35.89,35.89,35.89]
[18,15.32,21.869999999999997,36.480000000000004,41.47,44.529999999999987,45.330000000000013,47.890000000000015,52.45,52.45,54.860000000000014,54.860000000000014,36.269999999999996,36.269999999999996,36.269999999999996,36.269999999999996]
[19,15.369999999999997,21.910000000000004,38.19,43.25,45.52000000000001,46.410000000000011,50.16,54.19,54.19,56.289999999999992,56.289999999999992,37.090000000000003,37.090000000000003,37.090000000000003,37.090000000000003]
[20,15.399999999999999,21.959999999999994,38.22,43.349999999999994,45.550000000000011,47.929999999999993,50.19,55.259999999999991,55.259999999999991,59.870000000000005,59.870000000000005,37.11,37.11,37.11,37.11]
[21,16.18,23.059999999999995,41.47,44.960000000000008,48.260000000000005,50.339999999999989,52.570000000000007,56.53,56.53,61.449999999999989,61.449999999999989,37.259999999999991,37.259999999999991,37.259999999999991,37.259999999999991]
[22,16.920000000000002,24.350000000000009,42.52000000000001,46.59,49.510000000000005,51.709999999999994,53.680000000000007,57.799999999999983,57.799999999999983,62.81,62.81,37.590000000000003,37.590000000000003,37.590000000000003,37.590000000000003]
[23,17.009999999999998,24.39,43.7,47.75,50.219999999999985,53.629999999999995,56.099999999999994,59.370000000000005,59.370000000000005,63.830000000000013,63.830000000000013,37.629999999999995,37.629999999999995,37.629999999999995,37.629999999999995]
[24,17.46,24.440000000000005,44.740000000000009,48.330000000000013,51.980000000000004,54.769999999999982,56.139999999999986,60.489999999999981,60.489999999999981,65.009999999999991,65.009999999999991,41.460000000000008,41.460000000000008,41.460000000000008,41.460000000000008]
[25,17.509999999999998,24.479999999999997,45.080000000000013,48.459999999999994,52.02000000000001,54.819999999999993,56.19,62.390000000000015,62.390000000000015,65.390000000000015,65.390000000000015,41.499999999999986,41.499999999999986,41.499999999999986,41.499999999999986]
[26,18.629999999999995,26.640000000000008,47.400000000000006,51.210000000000008,54.52000000000001,57.550000000000011,58.670000000000016,63.34,63.34,67.400000000000006,67.400000000000006,44.089999999999989,44.089999999999989,44.089999999999989,44.089999999999989]
[27,18.68,26.800000000000004,48.569999999999993,52.350000000000009,55.66,58.41,60.129999999999995,64.660000000000025,64.660000000000025,68.5,68.5,44.129999999999995,44.129999999999995,44.129999999999995,44.129999999999995]
[28,19.130000000000003,26.849999999999994,49.870000000000005,53.38000000000001,56.989999999999981,59.69,62.5,65.87,65.87,69.919999999999987,69.919999999999987,44.180000000000007,44.180000000000007,44.180000000000007,44.180000000000007]
[29,19.180000000000007,26.89,51.120000000000005,54.400000000000006,57.03,60.72999999999999,63.81,66.919999999999987,66.919999999999987,71.450000000000017,71.450000000000017,44.92,44.92,44.92,44.92]
[30,19.21,26.919999999999987,51.149999999999991,54.429999999999978,57.06,61.669999999999987,63.84,68.130000000000024,68.130000000000024,71.72,71.72,45.419999999999987,45.419999999999987,45.419999999999987,45.419999999999987]
[31,20.049999999999997,27.879999999999995,53.280000000000015,56.930000000000007,60.609999999999985,62.84,65.88,69.349999999999994,69.349999999999994,73.990000000000009,73.990000000000009,48.09,48.09,48.09,48.09]
[32,20.629999999999995,28.549999999999997,54.400000000000006,58.119999999999976,61.800000000000011,64.050000000000011,66.930000000000007,70.670000000000016,70.670000000000016,75.53,75.53,48.14,48.14,48.14,48.14]
[33,21.11,30.159999999999997,55.47999999999999,59.28,63.47,65.200000000000017,68.570000000000022,72.260000000000019,72.260000000000019,77.109999999999985,77.109999999999985,49.070000000000007,49.070000000000007,49.070000000000007,49.070000000000007]
[34,21.57,30.200000000000003,56.78,61.430000000000007,64.819999999999993,67.889999999999986,69.900000000000006,73.759999999999991,73.759999999999991,78.53,78.53,50.650000000000006,50.650000000000006,50.650000000000006,50.650000000000006]
[35,22.029999999999994,30.239999999999995,56.820000000000022,61.489999999999981,64.860000000000014,68.010000000000019,70.97999999999999,75.22999999999999,75.22999999999999,80.04000000000002,80.04000000000002,55.110000000000014,55.110000000000014,55.110000000000014,55.110000000000014]
[36,22.950000000000003,31,59.129999999999995,62.72,67.12,69.240000000000009,72.710000000000008,76.700000000000017,76.700000000000017,81.759999999999991,81.759999999999991,55.97,55.97,55.97,55.97]
[37,23.11,33.08,60.550000000000011,65.599999999999994,68.640000000000015,72.430000000000007,73.59,78.340000000000032,78.340000000000032,83.050000000000011,83.050000000000011,56.010000000000019,56.010000000000019,56.010000000000019,56.010000000000019]
[38,23.149999999999991,33.129999999999995,61.519999999999982,65.66,69.97,72.47,74.81,79.78,79.78,84.629999999999967,84.629999999999967,56.06,56.06,56.06,56.06]
[39,23.92,33.17,62.69,68.019999999999982,71.63,74.069999999999993,76.149999999999977,81.350000000000023,81.350000000000023,84.66,84.66,56.099999999999994,56.099999999999994,56.099999999999994,56.099999999999994]
[40,23.969999999999992,33.210000000000008,62.730000000000018,68.069999999999993,71.670000000000016,74.13,76.190000000000026,82.980000000000018,82.980000000000018,84.690000000000026,84.690000000000026,56.139999999999986,56.139999999999986,56.139999999999986,56.139999999999986]
[41,25.069999999999993,35.06,64.980000000000018,69.799999999999983,74.539999999999992,75.900000000000034,79.399999999999977,84.620000000000033,84.620000000000033,89.82,89.82,59.97,59.97,59.97,59.97]
[42,25.439999999999998,35.11,66.25,71.319999999999993,75.81,77.689999999999969,81.22999999999999,86.329999999999984,86.329999999999984,89.860000000000014,89.860000000000014,62.29000000000002,62.29000000000002,62.29000000000002,62.29000000000002]
[43,26.120000000000005,35.789999999999992,67.549999999999983,72.75,77.360000000000014,78.930000000000035,84.35,88.070000000000022,88.070000000000022,89.889999999999986,89.889999999999986,63.06,63.06,63.06,63.06]
[44,26.710000000000008,37.659999999999997,68.699999999999989,74.13,78.799999999999983,79.950000000000017,84.820000000000022,89.97999999999999,89.97999999999999,94.309999999999974,94.309999999999974,63.120000000000005,63.120000000000005,63.120000000000005,63.120000000000005]
[45,27.080000000000013,38.460000000000008,69.930000000000007,75.460000000000008,78.84,82.579999999999984,86.300000000000011,91.4,91.4,94.34,94.34,63.16,63.16,63.16,63.16]
[46,27.820000000000007,39.27000000000001,71.139999999999986,76.429999999999978,81.56,82.72999999999999,87.659999999999968,92.989999999999981,92.989999999999981,97.230000000000018,97.230000000000018,64.27000000000001,64.27000000000001,64.27000000000001,64.27000000000001]
[47,28.159999999999997,39.849999999999994,72.069999999999993,77.820000000000022,82.610000000000014,83.200000000000017,88.980000000000018,94.490000000000009,94.490000000000009,97.28,97.28,64.319999999999993,64.319999999999993,64.319999999999993,64.319999999999993]
[48,28.210000000000008,39.89,72.12,77.860000000000014,82.669999999999987,83.239999999999981,90.19,96.259999999999991,96.259999999999991,97.31,97.31,64.660000000000025,64.660000000000025,64.660000000000025,64.660000000000025]
[49,28.260000000000005,39.940000000000012,72.16,77.909999999999968,82.70999999999998,83.29000000000002,91,97.94,97.94,99.380000000000024,99.380000000000024,64.699999999999989,64.699999999999989,64.699999999999989,64.699999999999989]
[50,28.310000000000002,39.980000000000018,72.210000000000008,77.950000000000017,83.009999999999991,83.330000000000013,91.04000000000002,97.97,97.97,99.44,99.44,64.739999999999981,64.739999999999981,64.739999999999981,64.739999999999981]
[51,31.22,43.600000000000009,76.79000000000002,82.81,87.990000000000009,90.230000000000018,94.529999999999973,101.28,101.28,102.24000000000001,102.24000000000001,65.87,65.87,65.87,65.87]
[52,31.689999999999998,44.529999999999987,77.919999999999987,84.37,89.200000000000017,91.869999999999976,99.320000000000022,103.70999999999998,103.70999999999998,106,106,65.910000000000025,65.910000000000025,65.910000000000025,65.910000000000025]
[53,32.049999999999997,45.260000000000005,79.089999999999975,85.78,89.830000000000013,93.82,99.380000000000024,105.03999999999999,105.03999999999999,106.03,106.03,69.5,69.5,69.5,69.5]
[54,32.089999999999989,46.159999999999982,80.359999999999985,85.829999999999984,89.879999999999967,93.869999999999976,100.03,107.44,107.44,108.88,108.88,69.549999999999983,69.549999999999983,69.549999999999983,69.549999999999983]
[55,32.14,47.009999999999991,81.93,88.19,89.920000000000016,97.22,101.76999999999998,108.94,108.94,109.96999999999997,109.96999999999997,69.59,69.59,69.59,69.59]
[56,33.94,47.899999999999991,83.389999999999986,89.359999999999985,94.070000000000022,99.210000000000008,103.5,110.43,110.43,111.45999999999998,111.45999999999998,69.63,69.63,69.63,69.63]
[57,34.910000000000011,49.2,83.430000000000035,90.619999999999976,95.830000000000013,100.94000000000003,107.97999999999996,112.27999999999997,112.27999999999997,112.29000000000002,112.29000000000002,75.44,75.44,75.44,75.44]
[58,34.959999999999994,49.53,83.47999999999999,91.860000000000014,95.869999999999976,102.82,108.02000000000004,114.49000000000001,114.49000000000001,115.57000000000005,115.57000000000005,77.210000000000008,77.210000000000008,77.210000000000008,77.210000000000008]
[59,35,50.339999999999989,83.519999999999982,93.289999999999992,95.920000000000016,104.47,108.50999999999999,115.13,115.13,117.27999999999997,117.27999999999997,80.269999999999982,80.269999999999982,80.269999999999982,80.269999999999982]
[60,35.049999999999997,50.379999999999995,83.570000000000022,94.47,95.960000000000008,104.51999999999998,110.25,117.55000000000001,117.55000000000001,118.66000000000003,118.66000000000003,80.320000000000022,80.320000000000022,80.320000000000022,80.320000000000022]
[61,36.97,52.139999999999986,89.389999999999986,96.130000000000024,102.26000000000002,108.12,113.18,120.69999999999999,120.69999999999999,121.82,121.82,81.34,81.34,81.34,81.34]
[62,37.450000000000003,53.069999999999993,90.750000000000028,97.35,103.85,109.69,117.38999999999999,122.17000000000002,122.17000000000002,123.33000000000004,123.33000000000004,81.379999999999967,81.379999999999967,81.379999999999967,81.379999999999967]
[63,37.5,54.120000000000005,90.900000000000034,98.84,103.90000000000003,111.25999999999999,117.42999999999995,124.18,124.18,125.34999999999997,125.34999999999997,85.580000000000013,85.580000000000013,85.580000000000013,85.580000000000013]
[64,39.450000000000003,54.789999999999992,91.95999999999998,101.13,106.71000000000004,113.28999999999996,117.49000000000001,126.07999999999998,126.07999999999998,127.25999999999999,127.25999999999999,85.62,85.62,85.62,85.62]
[65,39.490000000000009,56.22,94.829999999999984,101.65,106.75,115.07,122.96000000000004,126.10000000000002,126.10000000000002,127.30000000000001,127.30000000000001,85.669999999999987,85.669999999999987,85.669999999999987,85.669999999999987]
[66,39.72999999999999,56.260000000000019,95.119999999999976,101.70999999999998,107.89999999999998,117.08999999999997,123,128.26,128.26,129.46999999999997,129.46999999999997,85.710000000000008,85.710000000000008,85.710000000000008,85.710000000000008]
[67,39.769999999999996,58.319999999999993,97.990000000000009,104.62,112.63,119.41000000000003,123.31,132.34000000000003,132.34000000000003,133.57999999999998,133.57999999999998,85.75,85.75,85.75,85.75]
[68,41.03,59.81,99.269999999999982,107.56,112.67000000000002,120.49000000000001,125.32000000000005,132.64000000000004,132.64000000000004,133.88,133.88,85.800000000000011,85.800000000000011,85.800000000000011,85.800000000000011]
[69,41.069999999999993,59.850000000000023,100.58999999999997,107.62,113.04000000000002,121.63,127.39999999999998,132.65999999999997,132.65999999999997,133.90999999999997,133.90999999999997,85.84,85.84,85.84,85.84]
[70,41.120000000000005,59.899999999999977,101.74000000000001,109.07999999999998,113.08999999999997,121.67000000000002,129.19,132.69,132.69,133.94,133.94,85.889999999999986,85.889999999999986,85.889999999999986,85.889999999999986]
[71,42.389999999999986,60.06,101.83000000000001,110.53000000000003,115.15999999999997,124.57,130.72999999999996,132.71999999999997,132.71999999999997,133.97999999999996,133.97999999999996,89.799999999999983,89.799999999999983,89.799999999999983,89.799999999999983]
[72,42.759999999999991,60.680000000000007,101.87,112.02000000000004,115.20000000000005,125.78999999999996,132.82999999999998,135.22000000000003,135.22000000000003,135.23999999999995,135.23999999999995,89.850000000000023,89.850000000000023,89.850000000000023,89.850000000000023]
[73,42.8,63.240000000000009,102.97999999999999,112.07,115.24000000000001,127.73000000000002,133.76,141.45999999999998,141.45999999999998,141.47000000000003,141.47000000000003,89.889999999999986,89.889999999999986,89.889999999999986,89.889999999999986]
[74,42.849999999999994,63.28,103.09999999999997,112.10999999999996,115.28999999999996,127.76999999999998,133.80000000000001,141.49,141.49,145.77000000000004,145.77000000000004,89.940000000000026,89.940000000000026,89.940000000000026,89.940000000000026]
[75,42.89,63.330000000000013,104.78000000000003,112.16000000000003,115.32999999999998,127.82,133.84999999999997,141.51,141.51,145.79999999999995,145.79999999999995,89.97999999999999,89.97999999999999,89.97999999999999,89.97999999999999]
[76,45.489999999999995,65.22999999999999,107.75,115.81,120.67000000000002,130.07999999999998,140.61000000000001,146.89000000000004,146.89000000000004,146.90999999999997,146.90999999999997,95.080000000000013,95.080000000000013,95.080000000000013,95.080000000000013]
[77,45.539999999999992,67.420000000000016,109.01999999999998,117.75999999999999,125.56,137.36000000000001,142.46000000000004,152.91000000000003,152.91000000000003,152.92000000000002,152.92000000000002,96.580000000000013,96.580000000000013,96.580000000000013,96.580000000000013]
[78,45.600000000000009,68.19,109.07000000000005,123.16000000000003,126.37,138.22000000000003,142.5,152.93999999999994,152.93999999999994,152.95000000000005,152.95000000000005,96.63,96.63,96.63,96.63]
[79,45.639999999999986,68.230000000000018,110.47000000000003,125.42000000000002,128.54000000000002,141.20000000000005,142.54999999999995,152.98000000000002,152.98000000000002,154.40999999999997,154.40999999999997,96.669999999999987,96.669999999999987,96.669999999999987,96.669999999999987]
[80,45.679999999999993,68.28,110.51999999999998,125.47999999999996,128.58999999999997,141.25,142.59000000000003,153.00999999999993,153.00999999999993,154.44,154.44,99.75,99.75,99.75,99.75]
[81,49.870000000000005,71.419999999999987,114.68,127.49000000000001,131.05000000000001,143.94999999999999,147.19999999999999,153.03999999999996,153.03999999999996,154.47000000000003,154.47000000000003,99.789999999999992,99.789999999999992,99.789999999999992,99.789999999999992]
[82,49.910000000000011,71.47,114.73000000000002,127.54000000000002,131.09999999999997,144,147.26000000000005,153.07,153.07,154.5,154.5,99.830000000000013,99.830000000000013,99.830000000000013,99.830000000000013]
[83,49.950000000000017,71.56,114.76999999999998,127.57999999999998,131.16000000000003,144.03999999999996,147.31,153.10000000000002,153.10000000000002,154.53000000000003,154.53000000000003,99.88,99.88,99.88,99.88]
[84,49.999999999999986,71.670000000000016,114.82,127.63,131.19999999999999,144.09000000000003,147.34999999999997,153.15999999999997,153.15999999999997,160.94,160.94,99.919999999999987,99.919999999999987,99.919999999999987,99.919999999999987]
[85,50.039999999999992,72.56,118.57999999999998,127.67000000000002,134.21999999999997,144.13,147.40000000000003,159.75,159.75,165.55,165.55,99.97,99.97,99.97,99.97]
[86,51.61,73.450000000000017,118.63999999999999,131.23000000000002,134.26000000000005,149.23000000000002,150.90999999999997,159.78000000000003,159.78000000000003,170.73000000000002,170.73000000000002,103.90000000000003,103.90000000000003,103.90000000000003,103.90000000000003]
[87,51.650000000000006,75,123.03000000000003,133.89000000000004,134.32,150.17000000000002,155.76999999999998,164.78999999999996,164.78999999999996,170.75,170.75,111.05000000000001,111.05000000000001,111.05000000000001,111.05000000000001]
[88,51.699999999999989,75.199999999999989,123.87,133.94,138.18,152.73999999999995,155.81999999999994,170.76999999999998,170.76999999999998,170.78000000000003,170.78000000000003,111.08999999999997,111.08999999999997,111.08999999999997,111.08999999999997]
[89,51.769999999999982,75.25,123.92000000000002,134.51,144.97000000000003,154.01000000000005,161.82000000000005,177.14999999999998,177.14999999999998,177.16999999999996,177.16999999999996,111.14000000000004,111.14000000000004,111.14000000000004,111.14000000000004]
[90,51.819999999999993,75.31,128.58999999999997,138.19,145.01999999999998,154.18999999999994,164.84000000000003,178.7,178.7,182.81,182.81,115.32999999999998,115.32999999999998,115.32999999999998,115.32999999999998]
[91,54.649999999999977,78.47,131.57,138.23000000000002,145.06,154.24000000000007,164.89,178.73000000000002,178.73000000000002,182.85999999999996,182.85999999999996,115.38999999999999,115.38999999999999,115.38999999999999,115.38999999999999]
[92,54.699999999999989,78.739999999999981,131.62,139.51999999999998,148.15999999999997,154.53000000000003,164.92999999999995,183.90000000000003,183.90000000000003,183.91999999999996,183.91999999999996,119.41000000000003,119.41000000000003,119.41000000000003,119.41000000000003]
[93,54.740000000000009,78.78000000000003,133.63,143.51,148.21000000000004,159.83999999999997,164.97999999999996,183.93000000000006,183.93000000000006,183.95,183.95,119.45999999999998,119.45999999999998,119.45999999999998,119.45999999999998]
[94,54.789999999999992,79.549999999999983,133.67000000000002,143.55000000000001,148.26999999999998,160.46999999999997,165.02000000000004,183.95999999999998,183.95999999999998,183.98000000000002,183.98000000000002,124.11000000000001,124.11000000000001,124.11000000000001,124.11000000000001]
[95,54.84,79.590000000000032,133.70999999999998,144.32,148.31,160.52000000000004,165.07999999999998,184.01000000000005,184.01000000000005,184.01999999999998,184.01999999999998,124.14999999999998,124.14999999999998,124.14999999999998,124.14999999999998]
[96,58.330000000000013,83.45999999999998,134.91000000000003,145.86000000000001,149.43,163.99000000000007,170.34000000000003,184.03999999999996,184.03999999999996,184.05,184.05,124.19999999999999,124.19999999999999,124.19999999999999,124.19999999999999]
[97,58.97999999999999,83.69,138.71999999999997,147.54000000000002,156.77999999999997,169.70999999999998,170.39000000000004,184.07,184.07,184.08000000000004,184.08000000000004,124.24000000000001,124.24000000000001,124.24000000000001,124.24000000000001]
[98,59.03,83.730000000000018,138.77000000000004,147.58999999999997,156.82000000000005,169.76,170.43,184.10000000000002,184.10000000000002,187.75,187.75,124.36000000000001,124.36000000000001,124.36000000000001,124.36000000000001]
[99,59.69,83.77000000000001,138.82999999999998,147.63,156.87,169.81,176.64,184.13,184.13,187.78000000000003,187.78000000000003,125.64999999999998,125.64999999999998,125.64999999999998,125.64999999999998]
[100,60.580000000000013,85.990000000000009,143.91000000000003,154.83999999999997,161.05000000000001,174.05,181.14,190.60000000000002,190.60000000000002,194.44,194.44,130.01999999999998,130.01999999999998,130.01999999999998,130.01999999999998]
[101,61.180000000000007,86.850000000000023,145.35000000000002,156.38999999999999,162.66000000000003,175.78999999999996,182.95,192.50000000000006,192.50000000000006,196.38000000000005,196.38000000000005,131.32,131.32,131.32,131.32]
[102,61.789999999999992,87.70999999999998,146.79000000000002,157.94,164.26999999999998,177.52999999999997,184.76,194.40999999999997,194.40999999999997,198.32999999999998,198.32999999999998,132.62,132.62,132.62,132.62]
[103,62.390000000000015,88.570000000000022,148.23000000000002,159.49,165.88,179.26999999999998,186.57999999999998,196.32000000000005,196.32000000000005,200.26999999999998,200.26999999999998,133.92000000000002,133.92000000000002,133.92000000000002,133.92000000000002]
[104,63,89.429999999999978,149.66000000000003,161.04000000000002,167.48999999999995,181.00999999999993,188.39,198.21999999999997,198.21999999999997,202.22000000000003,202.22000000000003,135.22000000000003,135.22000000000003,135.22000000000003,135.22000000000003]
[105,63.610000000000014,90.29000000000002,151.10000000000002,162.58000000000004,169.10000000000002,182.75000000000006,190.2,200.13,200.13,204.15999999999997,204.15999999999997,136.51999999999998,136.51999999999998,136.51999999999998,136.51999999999998]
[106,64.210000000000008,91.149999999999977,152.54000000000002,164.13000000000005,170.71000000000004,184.49,192.01,202.03000000000003,202.03000000000003,206.11,206.11,137.82,137.82,137.82,137.82]
[107,64.819999999999993,92.009999999999991,153.98000000000002,165.67999999999995,172.32,186.23000000000002,193.82,203.94,203.94,208.04999999999995,208.04999999999995,139.12,139.12,139.12,139.12]
[108,65.420000000000016,92.869999999999976,155.42000000000002,167.22999999999996,173.93,187.97000000000003,195.62999999999994,205.85000000000002,205.85000000000002,209.99,209.99,140.42000000000002,140.42000000000002,140.42000000000002,140.42000000000002]
[109,66.03,93.72999999999999,156.86000000000001,168.77999999999997,175.53999999999996,189.70999999999998,197.43999999999994,207.74999999999994,207.74999999999994,211.94000000000005,211.94000000000005,141.72000000000003,141.72000000000003,141.72000000000003,141.72000000000003]
[110,66.639999999999986,94.590000000000032,158.30000000000007,170.32999999999998,177.14999999999998,191.45,199.25999999999993,209.66000000000003,209.66000000000003,213.87999999999994,213.87999999999994,143.01999999999998,143.01999999999998,143.01999999999998,143.01999999999998]
[111,67.240000000000009,95.449999999999989,159.74000000000007,171.87,178.76000000000005,193.18999999999994,201.06999999999994,211.56000000000006,211.56000000000006,215.83000000000004,215.83000000000004,144.32,144.32,144.32,144.32]
[112,67.849999999999994,96.31,161.18000000000006,173.42000000000002,180.37,194.93999999999994,202.87999999999994,213.46999999999997,213.46999999999997,217.76999999999998,217.76999999999998,145.62,145.62,145.62,145.62]
[113,68.450000000000017,97.169999999999987,162.61999999999995,174.97000000000003,181.98000000000002,196.68000000000006,204.69000000000005,215.38,215.38,219.71999999999991,219.71999999999991,146.92000000000002,146.92000000000002,146.92000000000002,146.92000000000002]
[114,69.06,98.03,164.05999999999995,176.52000000000004,183.58999999999997,198.42000000000002,206.50000000000006,217.27999999999997,217.27999999999997,221.65999999999997,221.65999999999997,148.22000000000003,148.22000000000003,148.22000000000003,148.22000000000003]
[115,69.66,98.889999999999986,165.48999999999995,178.07000000000005,185.2,200.16000000000003,208.31000000000006,219.19000000000005,219.19000000000005,223.60000000000002,223.60000000000002,149.51999999999998,149.51999999999998,149.51999999999998,149.51999999999998]
[116,70.27000000000001,99.75,166.92999999999995,179.62,186.82000000000005,201.90000000000003,210.12000000000006,221.09000000000003,221.09000000000003,225.54999999999995,225.54999999999995,150.82,150.82,150.82,150.82]
[117,70.88,100.61000000000001,168.36999999999995,181.17000000000002,188.42999999999995,203.64,211.94000000000005,223,223,227.49,227.49,152.11999999999995,152.11999999999995,152.11999999999995,152.11999999999995]
[118,71.480000000000018,101.47,169.80999999999995,182.71000000000004,190.04000000000002,205.38,213.75000000000006,224.90999999999997,224.90999999999997,229.44000000000005,229.44000000000005,153.42000000000007,153.42000000000007,153.42000000000007,153.42000000000007]
[119,72.089999999999975,102.33000000000001,171.25,184.25999999999993,191.64999999999998,207.11999999999995,215.56000000000006,226.80999999999995,226.80999999999995,231.38,231.38,154.72000000000003,154.72000000000003,154.72000000000003,154.72000000000003]
[120,72.69,103.19,172.69,185.80999999999995,193.26,208.85999999999996,217.37,228.72000000000003,228.72000000000003,233.33000000000004,233.33000000000004,156.01999999999998,156.01999999999998,156.01999999999998,156.01999999999998]
[121,73.300000000000011,104.05000000000001,174.13,187.35999999999996,194.87000000000006,210.60000000000008,219.18000000000006,230.62,230.62,235.26999999999998,235.26999999999998,157.32,157.32,157.32,157.32]
[122,73.900000000000006,104.90999999999997,175.57,188.90999999999997,196.47999999999996,212.34000000000003,220.99,232.52999999999997,232.52999999999997,237.22000000000003,237.22000000000003,158.61999999999995,158.61999999999995,158.61999999999995,158.61999999999995]
[123,74.510000000000019,105.77000000000001,177.01,190.45999999999998,198.09000000000003,214.08000000000004,222.79999999999995,234.43000000000006,234.43000000000006,239.16000000000008,239.16000000000008,159.92000000000007,159.92000000000007,159.92000000000007,159.92000000000007]
[124,75.119999999999976,106.62999999999997,178.45,192,199.69999999999993,215.82000000000005,224.62,236.33999999999992,236.33999999999992,241.09999999999991,241.09999999999991,161.22000000000003,161.22000000000003,161.22000000000003,161.22000000000003]
[125,75.72,107.49000000000001,179.89,193.55,201.31,217.55999999999995,226.42999999999995,238.25,238.25,243.04999999999995,243.04999999999995,162.51999999999998,162.51999999999998,162.51999999999998,162.51999999999998]
[126,76.330000000000013,108.35000000000002,181.32,195.10000000000002,202.92000000000007,219.29999999999995,228.24,240.15000000000009,240.15000000000009,244.99,244.99,163.82999999999998,163.82999999999998,163.82999999999998,163.82999999999998]
[127,76.930000000000035,109.20999999999998,182.76,196.65000000000003,204.52999999999997,221.03999999999996,230.04999999999995,242.05999999999995,242.05999999999995,246.93999999999994,246.93999999999994,165.12999999999994,165.12999999999994,165.12999999999994,165.12999999999994]
[128,77.539999999999964,110.07,184.2,198.20000000000005,206.14000000000004,222.77999999999997,231.86,243.96000000000004,243.96000000000004,248.88,248.88,166.43000000000006,166.43000000000006,166.43000000000006,166.43000000000006]
[129,78.139999999999986,110.93,185.64000000000004,199.75000000000006,207.74999999999994,224.51999999999998,233.66999999999996,245.87,245.87,250.83000000000004,250.83000000000004,167.73000000000002,167.73000000000002,167.73000000000002,167.73000000000002]
[130,78.75,111.79000000000002,187.08000000000004,201.29000000000002,209.36,226.26,235.48000000000002,247.77999999999997,247.77999999999997,252.76999999999998,252.76999999999998,169.02999999999997,169.02999999999997,169.02999999999997,169.02999999999997]
[131,79.360000000000014,112.64999999999998,188.52000000000004,202.84000000000003,210.97000000000003,228,237.29999999999995,249.68000000000006,249.68000000000006,254.72000000000003,254.72000000000003,170.32999999999998,170.32999999999998,170.32999999999998,170.32999999999998]
[132,79.960000000000036,113.50999999999999,189.96000000000004,204.38999999999993,212.57999999999998,229.75,239.11,251.59000000000003,251.59000000000003,256.65999999999997,256.65999999999997,171.62999999999994,171.62999999999994,171.62999999999994,171.62999999999994]
[133,80.569999999999965,114.36999999999995,191.40000000000003,205.93999999999994,214.19,231.49,240.91999999999996,253.49,253.49,258.60000000000002,258.60000000000002,172.93000000000006,172.93000000000006,172.93000000000006,172.93000000000006]
[134,81.169999999999987,115.23000000000002,192.84000000000003,207.48999999999995,215.79999999999995,233.23000000000002,242.7299999999999,255.39999999999998,255.39999999999998,260.55000000000007,260.55000000000007,174.23000000000002,174.23000000000002,174.23000000000002,174.23000000000002]
[135,81.78,116.09000000000003,194.28000000000003,209.03999999999996,217.40999999999997,234.97000000000003,244.53999999999996,257.30999999999995,257.30999999999995,262.49,262.49,175.52999999999997,175.52999999999997,175.52999999999997,175.52999999999997]
[136,82.390000000000015,116.94999999999999,195.72000000000003,210.58999999999997,219.0200000000001,236.70999999999992,246.34999999999991,259.21000000000004,259.21000000000004,264.43999999999994,264.43999999999994,176.82999999999998,176.82999999999998,176.82999999999998,176.82999999999998]
[137,82.990000000000009,117.81,197.15000000000003,212.13,220.64,238.44999999999993,248.15999999999997,261.12,261.12,266.38,266.38,178.12999999999994,178.12999999999994,178.12999999999994,178.12999999999994]
[138,83.599999999999966,118.66999999999996,198.58999999999992,213.68,222.25,240.19000000000005,249.98000000000002,263.02,263.02,268.32999999999993,268.32999999999993,179.43000000000006,179.43000000000006,179.43000000000006,179.43000000000006]
[139,84.199999999999989,119.53000000000003,200.02999999999997,215.23000000000002,223.8599999999999,241.93000000000006,251.79000000000008,264.92999999999995,264.92999999999995,270.27,270.27,180.73000000000002,180.73000000000002,180.73000000000002,180.73000000000002]
[140,84.81,120.38999999999999,201.46999999999997,216.77999999999997,225.47000000000003,243.67000000000007,253.60000000000002,266.84000000000003,266.84000000000003,272.21000000000004,272.21000000000004,182.02999999999997,182.02999999999997,182.02999999999997,182.02999999999997]
[141,85.410000000000025,121.25,202.90999999999997,218.33000000000004,227.08000000000004,245.40999999999997,255.41000000000008,268.74,268.74,274.15999999999997,274.15999999999997,183.32999999999998,183.32999999999998,183.32999999999998,183.32999999999998]
[142,86.02000000000001,122.11000000000001,204.34999999999997,219.88,228.68999999999994,247.14999999999998,257.22000000000003,270.64999999999998,270.64999999999998,276.10000000000002,276.10000000000002,184.62999999999994,184.62999999999994,184.62999999999994,184.62999999999994]

{"sheet":"SO E&I","index":13,"n_rows":159,"n_cols":13,"rows_kept":159,"cut":false,"hidden":true,"merged":[]}
[" FedEx Standard Overnight"]
["E&I Contract Zone Rates"]
[null,"Guaranteed delivery by  3 p.m. by Next Day"]
[]
[]
["Weight (in Lbs)",2,3,4,5,6,7,8,9,13,14,15,16]
[0.5,8.4299999999999979,8.4299999999999979,8.5100000000000016,9.09,9.1500000000000021,9.740000000000002,10.189999999999998,11.539999999999996,8.4299999999999979,8.4299999999999979,8.4299999999999979,8.4299999999999979]
["PAK1",8.6100000000000012,8.73,12.170000000000002,13.130000000000003,14.259999999999998,15.189999999999998,15.93,16.5,9.9200000000000017,9.9200000000000017,9.9200000000000017,9.9200000000000017]
["PAK2",8.6100000000000012,9.240000000000002,13.719999999999999,14.530000000000001,16.100000000000001,16.75,17.770000000000003,18.550000000000004,10.219999999999999,10.219999999999999,10.219999999999999,10.219999999999999]
[1,8.6100000000000012,8.73,12.170000000000002,13.130000000000003,14.259999999999998,15.189999999999998,15.93,16.5,9.9200000000000017,9.9200000000000017,9.9200000000000017,9.9200000000000017]
[2,8.6100000000000012,9.240000000000002,13.719999999999999,14.530000000000001,16.100000000000001,16.75,17.770000000000003,18.550000000000004,10.219999999999999,10.219999999999999,10.219999999999999,10.219999999999999]
[3,8.6100000000000012,9.7800000000000011,15.219999999999999,16.100000000000001,17.840000000000003,18.43,19.43,20.099999999999994,11.23,11.23,11.23,11.23]
[4,8.6100000000000012,10.400000000000002,16.490000000000002,17.64,19.5,20.060000000000002,21.269999999999996,22.1,13.329999999999998,13.329999999999998,13.329999999999998,13.329999999999998]
[5,8.6100000000000012,10.449999999999996,17.54,19.179999999999993,20.790000000000006,21.380000000000003,22.559999999999995,23.789999999999992,13.560000000000002,13.560000000000002,13.560000000000002,13.560000000000002]
[6,8.6100000000000012,11.91,19.509999999999998,20.450000000000003,22.54,22.9,24.340000000000003,25.799999999999997,16.420000000000002,16.420000000000002,16.420000000000002,16.420000000000002]
[7,8.8100000000000023,12.43,20.880000000000003,22.220000000000006,24.129999999999995,24.619999999999997,26.009999999999991,27.350000000000009,17.21,17.21,17.21,17.21]
[8,9.2700000000000031,12.79,22.25,23.660000000000004,25.760000000000005,26.36999999999999,27.63000000000001,28.840000000000003,18.07,18.07,18.07,18.07]
[9,9.6499999999999986,13.329999999999998,23.499999999999993,25.170000000000009,27.350000000000009,28.11,29.42,30.870000000000005,19.109999999999992,19.109999999999992,19.109999999999992,19.109999999999992]
[10,9.6899999999999977,13.869999999999997,24.32,26.519999999999996,28.08,29.739999999999995,31.180000000000007,32.69,21.310000000000002,21.310000000000002,21.310000000000002,21.310000000000002]
[11,10.34,14.469999999999999,25.85,27.950000000000003,30.599999999999994,31.489999999999995,32.88000000000001,34.680000000000007,22.160000000000004,22.160000000000004,22.160000000000004,22.160000000000004]
[12,10.68,15.209999999999994,27.269999999999996,29.230000000000004,32.100000000000009,33.209999999999994,34.629999999999995,35.97,23.919999999999995,23.919999999999995,23.919999999999995,23.919999999999995]
[13,10.8,15.970000000000006,28.570000000000007,30.590000000000003,33.39,34.960000000000008,36.299999999999997,37.659999999999997,24.540000000000006,24.540000000000006,24.540000000000006,24.540000000000006]
[14,11.220000000000002,16.590000000000003,30.019999999999996,31.88000000000001,34.69,36.490000000000009,38.100000000000009,39.659999999999982,25.260000000000005,25.260000000000005,25.260000000000005,25.260000000000005]
[15,11.650000000000002,17.160000000000004,31.080000000000013,33.160000000000011,35.830000000000013,37.700000000000003,39.53,41.209999999999994,25.989999999999995,25.989999999999995,25.989999999999995,25.989999999999995]
[16,11.889999999999997,17.32,32.56,34.39,37.170000000000016,38.680000000000007,40.540000000000006,42.249999999999986,26.599999999999994,26.599999999999994,26.599999999999994,26.599999999999994]
[17,12.5,17.899999999999999,33.480000000000004,35.5,38.030000000000015,39.559999999999988,41.400000000000006,43.210000000000008,27.36,27.36,27.36,27.36]
[18,12.870000000000005,18.100000000000001,34.489999999999995,36.230000000000004,38.86999999999999,40.410000000000011,42.509999999999991,44.25,27.5,27.5,27.5,27.5]
[19,13.219999999999999,18.86,35.309999999999988,36.989999999999995,39.739999999999995,41.309999999999988,43.61999999999999,45.849999999999994,29.099999999999994,29.099999999999994,29.099999999999994,29.099999999999994]
[20,13.46,19.43,36.86,39.86,41.88000000000001,44.06,47.039999999999992,48.599999999999994,29.150000000000006,29.150000000000006,29.150000000000006,29.150000000000006]
[21,13.82,19.799999999999997,39.070000000000007,41.180000000000007,44.290000000000006,46.120000000000005,48.64,49.550000000000011,31.11999999999999,31.11999999999999,31.11999999999999,31.11999999999999]
[22,14.310000000000002,20.220000000000006,40.059999999999988,42.13000000000001,45.450000000000017,47.379999999999995,49.669999999999987,50.760000000000005,31.159999999999997,31.159999999999997,31.159999999999997,31.159999999999997]
[23,14.559999999999995,20.61,41.180000000000007,43.2,46.090000000000018,48.379999999999995,50.88000000000001,51.13000000000001,32.200000000000003,32.200000000000003,32.200000000000003,32.200000000000003]
[24,14.919999999999995,20.950000000000003,42.160000000000011,44.28,47.710000000000008,49.440000000000012,51.91,53.349999999999994,33.11,33.11,33.11,33.11]
[25,15.259999999999998,21.380000000000003,42.210000000000008,45.5,47.750000000000014,50.980000000000004,51.960000000000008,54.760000000000019,33.709999999999994,33.709999999999994,33.709999999999994,33.709999999999994]
[26,15.600000000000001,21.989999999999995,44.370000000000005,46.66,50,52.259999999999991,54.330000000000013,55.990000000000009,35.840000000000003,35.840000000000003,35.840000000000003,35.840000000000003]
[27,15.849999999999994,22.590000000000003,45.52000000000001,47.839999999999989,51.060000000000016,53.569999999999993,55.72999999999999,57.240000000000009,36.069999999999993,36.069999999999993,36.069999999999993,36.069999999999993]
[28,16.340000000000003,23.18,46.77000000000001,48.819999999999993,52.329999999999984,54.789999999999992,57.31,58.800000000000011,37.960000000000008,37.960000000000008,37.960000000000008,37.960000000000008]
[29,16.690000000000005,23.619999999999997,48.009999999999991,49.78,53.31,55.77000000000001,58.879999999999995,59.800000000000011,38.61999999999999,38.61999999999999,38.61999999999999,38.61999999999999]
[30,16.96,23.880000000000003,48.05,50.789999999999992,53.370000000000005,56.66,59.59,60.77000000000001,39.330000000000013,39.330000000000013,39.330000000000013,39.330000000000013]
[31,17.28,24.149999999999991,50.11,52.19,55.77000000000001,57.789999999999992,61.240000000000009,61.849999999999994,40.78,40.78,40.78,40.78]
[32,17.64,24.57,51.210000000000008,53.31,56.91,58.94,62.25,63.03,41.72,41.72,41.72,41.72]
[33,18.03,25.060000000000002,52.259999999999991,54.400000000000006,58.489999999999981,60.02000000000001,63.819999999999993,64.480000000000018,42.710000000000008,42.710000000000008,42.710000000000008,42.710000000000008]
[34,18.350000000000001,25.620000000000005,53.519999999999982,55.380000000000024,59.77000000000001,61.329999999999984,65.09,65.740000000000009,43.600000000000009,43.600000000000009,43.600000000000009,43.600000000000009]
[35,18.86,26.120000000000005,53.569999999999993,56.509999999999991,59.830000000000013,62.680000000000007,65.75,65.759999999999991,44.629999999999995,44.629999999999995,44.629999999999995,44.629999999999995]
[36,19.21,26.680000000000007,55.81,57.669999999999987,61.97999999999999,63.849999999999994,67.13,67.150000000000006,45.629999999999995,45.629999999999995,45.629999999999995,45.629999999999995]
[37,19.57,27.040000000000006,57.110000000000014,59.050000000000011,63.400000000000006,64.94,68.080000000000013,68.099999999999994,46.639999999999986,46.639999999999986,46.639999999999986,46.639999999999986]
[38,19.920000000000009,27.590000000000003,58.150000000000006,60.47,64.670000000000016,65.88,69.41,69.420000000000016,46.679999999999993,46.679999999999993,46.679999999999993,46.679999999999993]
[39,20.420000000000009,28.239999999999995,59.28,61.72999999999999,66.240000000000009,67.050000000000011,71.080000000000013,73.09,48.659999999999982,48.659999999999982,48.659999999999982,48.659999999999982]
[40,20.75,28.92,59.330000000000013,62.739999999999981,66.299999999999983,68.490000000000009,71.119999999999976,73.12,49.669999999999987,49.669999999999987,49.669999999999987,49.669999999999987]
[41,21.11,29.290000000000006,61.519999999999982,64.380000000000024,69,69.75,74.190000000000026,76.12,50.669999999999987,50.669999999999987,50.669999999999987,50.669999999999987]
[42,21.500000000000007,29.72,62.769999999999982,65.820000000000022,70.210000000000008,71.139999999999986,75.949999999999989,77.700000000000017,51.7,51.7,51.7,51.7]
[43,21.860000000000007,30.36,64.039999999999992,67.180000000000007,71.699999999999989,72.580000000000013,77.599999999999994,77.72999999999999,52.44,52.44,52.44,52.44]
[44,22.230000000000004,30.899999999999991,65.16,68.490000000000009,73.069999999999993,73.800000000000011,79.370000000000033,80.609999999999985,53.210000000000008,53.210000000000008,53.210000000000008,53.210000000000008]
[45,22.590000000000003,31.559999999999988,66.360000000000014,69.75,73.109999999999985,75.169999999999987,80.800000000000011,81.240000000000009,54.099999999999994,54.099999999999994,54.099999999999994,54.099999999999994]
[46,22.940000000000005,32.100000000000009,67.539999999999992,70.680000000000007,75.69,76.640000000000015,82.110000000000014,83.25,54.139999999999986,54.139999999999986,54.139999999999986,54.139999999999986]
[47,23.429999999999993,32.760000000000005,68.5,71.989999999999981,76.680000000000007,78.19,83.260000000000019,83.279999999999973,54.330000000000013,54.330000000000013,54.330000000000013,54.330000000000013]
[48,23.769999999999996,33.409999999999997,68.539999999999992,73.28,76.71999999999997,79.399999999999977,84.509999999999991,85.71999999999997,55.759999999999991,55.759999999999991,55.759999999999991,55.759999999999991]
[49,24.129999999999995,34.069999999999993,68.59,73.319999999999993,76.78000000000003,79.440000000000026,85.289999999999964,85.75,55.800000000000011,55.800000000000011,55.800000000000011,55.800000000000011]
[50,24.61,34.569999999999993,68.639999999999986,73.380000000000024,76.819999999999993,79.490000000000009,85.330000000000013,85.799999999999983,55.859999999999985,55.859999999999985,55.859999999999985,55.859999999999985]
[51,24.960000000000008,35.239999999999995,73.039999999999992,76.71999999999997,81.789999999999992,83.620000000000033,88.679999999999978,89.179999999999978,59.800000000000011,59.800000000000011,59.800000000000011,59.800000000000011]
[52,25.460000000000008,35.769999999999996,74.16,78.19,82.94,85.32,90.37,92.02000000000001,60.81,60.81,60.81,60.81]
[53,25.92,36.519999999999996,75.279999999999973,79.549999999999983,83.550000000000011,87.159999999999968,92.25,93.589999999999975,61.799999999999983,61.799999999999983,61.799999999999983,61.799999999999983]
[54,26.28,37.240000000000009,76.539999999999992,80.740000000000009,83.59,89.119999999999976,93.949999999999989,95.27000000000001,62.78,62.78,62.78,62.78]
[55,26.769999999999996,38.019999999999996,78.050000000000011,81.839999999999975,83.639999999999986,90.390000000000015,95.6,96.940000000000026,63.819999999999993,63.819999999999993,63.819999999999993,63.819999999999993]
[56,27.260000000000005,38.659999999999997,79.549999999999983,82.94,87.580000000000013,92.289999999999992,97.27000000000001,98.29000000000002,63.880000000000024,63.880000000000024,63.880000000000024,63.880000000000024]
[57,27.850000000000009,39.47999999999999,79.590000000000032,84.02000000000001,89.22,93.920000000000016,98.549999999999983,99.549999999999983,65.449999999999989,65.449999999999989,65.449999999999989,65.449999999999989]
[58,28.450000000000003,40.39,79.63,85.21999999999997,91.119999999999976,95.700000000000017,99.56,99.580000000000013,67.410000000000025,67.410000000000025,67.410000000000025,67.410000000000025]
[59,28.939999999999998,41.429999999999993,79.679999999999978,86.570000000000022,91.760000000000019,97.27000000000001,101.61000000000001,101.62000000000003,67.460000000000008,67.460000000000008,67.460000000000008,67.460000000000008]
[60,29.39,42.350000000000009,79.72,87.78,91.800000000000011,99.07,103.64999999999998,103.67000000000002,68.180000000000007,68.180000000000007,68.180000000000007,68.180000000000007]
[61,29.909999999999997,43.140000000000015,85.330000000000013,89.35,95.360000000000014,100.72999999999999,105.49000000000001,106.59000000000003,70.109999999999985,70.109999999999985,70.109999999999985,70.109999999999985]
[62,30.730000000000004,43.759999999999991,86.659999999999968,90.52000000000001,96.870000000000033,102.20999999999998,107.45000000000005,109.12,70.16,70.16,70.16,70.16]
[63,31.189999999999998,44.629999999999995,86.799999999999983,91.929999999999978,98.510000000000019,103.71000000000004,109.40000000000003,111.58999999999997,72.460000000000008,72.460000000000008,72.460000000000008,72.460000000000008]
[64,31.349999999999994,44.809999999999988,86.850000000000023,93.330000000000013,99.580000000000013,105.63999999999999,109.44,111.88999999999999,72.70999999999998,72.70999999999998,72.70999999999998,72.70999999999998]
[65,32.300000000000011,46.3,90.689999999999969,94.579999999999984,99.619999999999976,107.32,111.92000000000002,111.92999999999995,72.75,72.75,72.75,72.75]
[66,32.89,46.34,90.94,94.649999999999977,103.43999999999997,109.24000000000001,114.28000000000003,114.29000000000002,72.789999999999992,72.789999999999992,72.789999999999992,72.789999999999992]
[67,33.36,48.17,93.72999999999999,97.419999999999987,105.21000000000004,110.84999999999997,116.15000000000003,118.98999999999995,77.56,77.56,77.56,77.56]
[68,33.97,49.059999999999988,94.97,98.810000000000031,106.82,112.44999999999999,118.04999999999995,120.80000000000001,77.599999999999994,77.599999999999994,77.599999999999994,77.599999999999994]
[69,34.589999999999989,49.870000000000005,96.259999999999991,100.25000000000003,106.86000000000001,113.54000000000002,119.82,120.82999999999998,77.659999999999968,77.659999999999968,77.659999999999968,77.659999999999968]
[70,35.28,50.900000000000006,97.43,101.63999999999999,108.49000000000001,113.58999999999997,120.99000000000001,122.41000000000003,79.010000000000019,79.010000000000019,79.010000000000019,79.010000000000019]
[71,35.959999999999994,51.710000000000008,97.47,103.01999999999998,108.54999999999995,116.24000000000001,121.02999999999997,122.44,79.06,79.06,79.06,79.06]
[72,36.710000000000008,52.519999999999982,97.52000000000001,104.43,109.02000000000004,117.49000000000001,123,125.16000000000003,79.099999999999966,79.099999999999966,79.099999999999966,79.099999999999966]
[73,37.240000000000009,53.699999999999989,98.639999999999986,105.96999999999997,110.57999999999998,119.33000000000004,123.83999999999997,126.94,79.140000000000015,79.140000000000015,79.140000000000015,79.140000000000015]
[74,37.38000000000001,53.81,98.679999999999978,107.17999999999995,110.62,121.01999999999998,123.88,126.96000000000004,79.19,79.19,79.19,79.19]
[75,38.509999999999991,55.349999999999994,100.40000000000003,107.22000000000003,110.68,121.06,126.97999999999996,126.99000000000001,79.230000000000018,79.230000000000018,79.230000000000018,79.230000000000018]
[76,39.110000000000014,55.400000000000006,103.28999999999996,111.13999999999999,115.88,125.05000000000001,130.67000000000002,133.69,79.27000000000001,79.27000000000001,79.27000000000001,79.27000000000001]
[77,39.239999999999995,56.289999999999992,103.33000000000001,111.82,120.63999999999999,131.05000000000001,132.41000000000003,137.38,79.319999999999965,79.319999999999965,79.319999999999965,79.319999999999965]
[78,40.440000000000012,58.06,104.39999999999998,117.07,121.44,131.99,132.44999999999999,137.40000000000003,79.360000000000014,79.360000000000014,79.360000000000014,79.360000000000014]
[79,40.940000000000012,59.130000000000024,105.80000000000001,119.26000000000005,123.55000000000001,132.93,132.94,142.82,79.399999999999977,79.399999999999977,79.399999999999977,79.399999999999977]
[80,41.029999999999987,60.079999999999984,105.85000000000002,119.30000000000001,123.59999999999997,132.96999999999997,132.98000000000002,142.85000000000002,79.440000000000026,79.440000000000026,79.440000000000026,79.440000000000026]
[81,42.240000000000009,61.099999999999994,109.90000000000003,121.25999999999999,126,136.87,136.88999999999999,143.24,79.490000000000009,79.490000000000009,79.490000000000009,79.490000000000009]
[82,43.2,62.080000000000013,109.96000000000004,121.31,126.03999999999996,136.91999999999996,136.93,145.40999999999997,79.529999999999973,79.529999999999973,79.529999999999973,79.529999999999973]
[83,43.8,63.09,110,122.62,126.10000000000002,136.96000000000004,136.97000000000003,145.44,79.599999999999966,79.599999999999966,79.599999999999966,79.599999999999966]
[84,44.290000000000006,64.069999999999993,110.04000000000002,122.65999999999997,126.13999999999999,137,137.01999999999998,145.47999999999996,82.670000000000016,82.670000000000016,82.670000000000016,82.670000000000016]
[85,44.5,65.12,113.85000000000002,122.69999999999999,129.07999999999998,138.74,140.31,150.19,85.050000000000011,85.050000000000011,85.050000000000011,85.050000000000011]
[86,45.459999999999994,66.049999999999983,113.89999999999998,126.17000000000002,129.12,140.34000000000003,140.36000000000001,150.22000000000003,85.1,85.1,85.1,85.1]
[87,45.959999999999994,67.12,118.04999999999995,127.43,129.18,144.63,144.94999999999999,154.86000000000007,85.149999999999977,85.149999999999977,85.149999999999977,85.149999999999977]
[88,46.010000000000005,68.169999999999987,119,128.01999999999998,132.94,147.13999999999999,147.14999999999998,156.75999999999993,85.19,85.19,85.19,85.19]
[89,47.13000000000001,69.210000000000008,119.04000000000002,129.37,139.56,148.38000000000005,151.92999999999995,156.82,85.22999999999999,85.22999999999999,85.22999999999999,85.22999999999999]
[90,47.170000000000016,69.259999999999991,123.59999999999997,131.58999999999997,139.61000000000001,148.54999999999995,154.80000000000001,159.12999999999994,86.889999999999986,86.889999999999986,86.889999999999986,86.889999999999986]
[91,47.42,71.22,126.5,132.44999999999999,139.64999999999998,148.59000000000003,154.83999999999997,159.15999999999997,87.77000000000001,87.77000000000001,87.77000000000001,87.77000000000001]
[92,48.400000000000006,71.730000000000018,126.54999999999995,134.25,142.67999999999995,148.88000000000005,154.88999999999993,161.31,94.260000000000019,94.260000000000019,94.260000000000019,94.260000000000019]
[93,49.39,71.769999999999982,128.36000000000001,136.73000000000002,142.72000000000003,154.04999999999995,154.93000000000006,166.71999999999997,94.31,94.31,94.31,94.31]
[94,49.440000000000012,73.66,128.40000000000003,137.98000000000002,142.77999999999997,154.66999999999996,154.97000000000003,166.75,94.359999999999985,94.359999999999985,94.359999999999985,94.359999999999985]
[95,49.480000000000018,74.120000000000033,128.46000000000004,138.92999999999995,142.82,154.71000000000004,159.15999999999997,166.78000000000003,98.37,98.37,98.37,98.37]
[96,51.38000000000001,74.170000000000016,129.76,140.43,143.90999999999997,158.10000000000002,164.29000000000002,168.63999999999993,98.41,98.41,98.41,98.41]
[97,51.420000000000016,75.900000000000006,133.46999999999997,142.07,151.06999999999994,163.66999999999996,164.33000000000004,171.32999999999998,98.450000000000017,98.450000000000017,98.450000000000017,98.450000000000017]
[98,51.469999999999985,75.949999999999989,133.52000000000004,142.11000000000001,151.11000000000007,163.73000000000002,164.38,172.44999999999993,104.13,104.13,104.13,104.13]
[99,51.509999999999991,75.990000000000009,133.57,142.16000000000003,151.16000000000003,163.76999999999998,164.43000000000006,173.56,105.25,105.25,105.25,105.25]
[100,51.55,76.03,138.52999999999997,147.45999999999998,154.07999999999998,166.18,170.77999999999997,175.97000000000003,111.45999999999998,111.45999999999998,111.45999999999998,111.45999999999998]
[101,52.069999999999993,76.789999999999992,139.91000000000003,148.93,155.62,167.83999999999997,172.48999999999995,177.73000000000002,112.57,112.57,112.57,112.57]
[102,52.580000000000013,77.549999999999983,141.30000000000001,150.41000000000003,157.16000000000003,169.49999999999994,174.2,179.49,113.69,113.69,113.69,113.69]
[103,53.099999999999994,78.31,142.68,151.88,158.69999999999993,171.15999999999997,175.90999999999997,181.25000000000006,114.80000000000001,114.80000000000001,114.80000000000001,114.80000000000001]
[104,53.609999999999985,79.069999999999993,144.07,153.35000000000002,160.23999999999995,172.82000000000005,177.62,183.01000000000005,115.91000000000003,115.91000000000003,115.91000000000003,115.91000000000003]
[105,54.129999999999995,79.829999999999984,145.44999999999999,154.83000000000004,161.77999999999997,174.48000000000002,179.32,184.76999999999998,117.03000000000003,117.03000000000003,117.03000000000003,117.03000000000003]
[106,54.650000000000006,80.589999999999975,146.84000000000003,156.30000000000001,163.32000000000005,176.14999999999998,181.03000000000003,186.52999999999997,118.14000000000004,118.14000000000004,118.14000000000004,118.14000000000004]
[107,55.16,81.350000000000023,148.21999999999997,157.78000000000003,164.87000000000006,177.81,182.74,188.28999999999996,119.25999999999999,119.25999999999999,119.25999999999999,119.25999999999999]
[108,55.680000000000007,82.110000000000014,149.61000000000001,159.25000000000006,166.40999999999997,179.46999999999997,184.45000000000005,190.05,120.37,120.37,120.37,120.37]
[109,56.190000000000026,82.87,150.99999999999994,160.73000000000002,167.95,181.12999999999994,186.14999999999998,191.81,121.49000000000001,121.49000000000001,121.49000000000001,121.49000000000001]
[110,56.710000000000008,83.639999999999986,152.38,162.20000000000005,169.49,182.79000000000002,187.85999999999996,193.56,122.59999999999997,122.59999999999997,122.59999999999997,122.59999999999997]
[111,57.22,84.400000000000034,153.76999999999998,163.68000000000006,171.03000000000003,184.46000000000004,189.57,195.32000000000005,123.71999999999997,123.71999999999997,123.71999999999997,123.71999999999997]
[112,57.739999999999981,85.16,155.15000000000003,165.15000000000003,172.57000000000005,186.12,191.27999999999997,197.08000000000004,124.82999999999998,124.82999999999998,124.82999999999998,124.82999999999998]
[113,58.25,85.919999999999987,156.53999999999996,166.62999999999994,174.10999999999996,187.77999999999997,192.99,198.83999999999997,125.94999999999999,125.94999999999999,125.94999999999999,125.94999999999999]
[114,58.77000000000001,86.679999999999978,157.92000000000002,168.09999999999997,175.64999999999998,189.44,194.69,200.59999999999997,127.06,127.06,127.06,127.06]
[115,59.28,87.440000000000026,159.31,169.56999999999994,177.19,191.09999999999997,196.40000000000003,202.35999999999996,128.17000000000002,128.17000000000002,128.17000000000002,128.17000000000002]
[116,59.799999999999983,88.200000000000017,160.69000000000005,171.04999999999995,178.73000000000002,192.76000000000005,198.11,204.12,129.29000000000002,129.29000000000002,129.29000000000002,129.29000000000002]
[117,60.319999999999993,88.960000000000008,162.07999999999998,172.51999999999998,180.27000000000004,194.43,199.81999999999994,205.88,130.40000000000003,130.40000000000003,130.40000000000003,130.40000000000003]
[118,60.830000000000013,89.71999999999997,163.46000000000004,173.99999999999994,181.80999999999995,196.09000000000003,201.53000000000003,207.64,131.52000000000004,131.52000000000004,131.52000000000004,131.52000000000004]
[119,61.349999999999994,90.480000000000018,164.84999999999997,175.46999999999997,183.35999999999996,197.75,203.22999999999996,209.39999999999998,132.63,132.63,132.63,132.63]
[120,61.860000000000014,91.240000000000009,166.23000000000002,176.95,184.89999999999998,199.40999999999997,204.94,211.16000000000008,133.75,133.75,133.75,133.75]
[121,62.379999999999995,92,167.62,178.41999999999996,186.44,201.06999999999994,206.64999999999998,212.91999999999996,134.85999999999996,134.85999999999996,134.85999999999996,134.85999999999996]
[122,62.889999999999986,92.759999999999991,169.00000000000006,179.89999999999998,187.98000000000002,202.73000000000008,208.36,214.67999999999995,135.97999999999996,135.97999999999996,135.97999999999996,135.97999999999996]
[123,63.41,93.520000000000039,170.39,181.37,189.51999999999998,204.40000000000003,210.05999999999995,216.43999999999994,137.08999999999997,137.08999999999997,137.08999999999997,137.08999999999997]
[124,63.920000000000016,94.28,171.77000000000004,182.85000000000002,191.06,206.06,211.7700000000001,218.19999999999993,138.20999999999998,138.20999999999998,138.20999999999998,138.20999999999998]
[125,64.44,95.039999999999992,173.16000000000003,184.32,192.60000000000002,207.72000000000003,213.48000000000002,219.96000000000004,139.32,139.32,139.32,139.32]
[126,64.95999999999998,95.799999999999983,174.54999999999995,185.79000000000002,194.14000000000004,209.38,215.18999999999994,221.72000000000003,140.43,140.43,140.43,140.43]
[127,65.47,96.559999999999974,175.93,187.26999999999998,195.68000000000006,211.03999999999996,216.89999999999998,223.48000000000002,141.55000000000001,141.55000000000001,141.55000000000001,141.55000000000001]
[128,65.990000000000009,97.320000000000022,177.31999999999994,188.74,197.21999999999997,212.70999999999992,218.59999999999991,225.24,142.66000000000003,142.66000000000003,142.66000000000003,142.66000000000003]
[129,66.5,98.080000000000013,178.7,190.22000000000003,198.76,214.37,220.31000000000006,227,143.78000000000003,143.78000000000003,143.78000000000003,143.78000000000003]
[130,67.019999999999982,98.839999999999975,180.08999999999997,191.69,200.3,216.02999999999997,222.01999999999998,228.76,144.89000000000004,144.89000000000004,144.89000000000004,144.89000000000004]
[131,67.53,99.599999999999966,181.47000000000003,193.17000000000002,201.84000000000003,217.69000000000005,223.73000000000002,230.51999999999998,146.01000000000005,146.01000000000005,146.01000000000005,146.01000000000005]
[132,68.050000000000011,100.36000000000001,182.85999999999996,194.64000000000004,203.39000000000004,219.35000000000002,225.42999999999995,232.27999999999997,147.11999999999995,147.11999999999995,147.11999999999995,147.11999999999995]
[133,68.56,101.12,184.24,196.12000000000006,204.92999999999995,221.01,227.1400000000001,234.03999999999996,148.24,148.24,148.24,148.24]
[134,69.080000000000013,101.88,185.62999999999994,197.59000000000003,206.46999999999997,222.67999999999995,228.85000000000002,235.79999999999995,149.35000000000002,149.35000000000002,149.35000000000002,149.35000000000002]
[135,69.599999999999994,102.63999999999999,187.01000000000005,199.07000000000005,208.01,224.34000000000003,230.55999999999995,237.56000000000006,150.47000000000003,150.47000000000003,150.47000000000003,150.47000000000003]
[136,70.109999999999985,103.40000000000003,188.39999999999998,200.54000000000008,209.55000000000007,226,232.26999999999998,239.32000000000005,151.58000000000004,151.58000000000004,151.58000000000004,151.58000000000004]
[137,70.63,104.16000000000003,189.78000000000003,202.01000000000005,211.09000000000003,227.65999999999997,233.96999999999991,241.08000000000004,152.69000000000005,152.69000000000005,152.69000000000005,152.69000000000005]
[138,71.140000000000015,104.92000000000002,191.16999999999996,203.48999999999995,212.63,229.31999999999994,235.68000000000006,242.83999999999992,153.80999999999995,153.80999999999995,153.80999999999995,153.80999999999995]
[139,71.66,105.68,192.55,204.95999999999992,214.16999999999996,230.98000000000002,237.39,244.59999999999991,154.91999999999996,154.91999999999996,154.91999999999996,154.91999999999996]
[140,72.169999999999987,106.44,193.94,206.43999999999994,215.71000000000004,232.64999999999998,239.10000000000002,246.36,156.03999999999996,156.03999999999996,156.03999999999996,156.03999999999996]
[141,72.69,107.21000000000004,195.32000000000005,207.90999999999997,217.25,234.31000000000006,240.80999999999995,248.11,157.14999999999998,157.14999999999998,157.14999999999998,157.14999999999998]
[142,73.200000000000017,107.96999999999997,196.70999999999998,209.39,218.79000000000008,235.97000000000003,242.51,249.87,158.26999999999998,158.26999999999998,158.26999999999998,158.26999999999998]
[143,73.72,108.72999999999996,198.10000000000002,210.86,220.32999999999993,237.63,244.22000000000003,251.63,159.38,159.38,159.38,159.38]
[144,74.22999999999999,109.49000000000001,199.47999999999996,212.33999999999992,221.88,239.28999999999996,245.92999999999995,253.39,160.5,160.5,160.5,160.5]
[145,74.75,110.25,200.87000000000006,213.80999999999995,223.41999999999996,240.95999999999992,247.64,255.15000000000009,161.60999999999996,161.60999999999996,161.60999999999996,161.60999999999996]
[146,75.269999999999982,111.00999999999999,202.25,215.28999999999996,224.96000000000004,242.62,249.33999999999992,256.90999999999997,162.72999999999996,162.72999999999996,162.72999999999996,162.72999999999996]
[147,75.78,111.76999999999998,203.64000000000004,216.76,226.5,244.28000000000009,251.05000000000007,258.66999999999996,163.83999999999997,163.83999999999997,163.83999999999997,163.83999999999997]
[148,76.300000000000011,112.53000000000003,205.01999999999998,218.23000000000002,228.03999999999996,245.94000000000005,252.76,260.42999999999995,164.95,164.95,164.95,164.95]
[149,76.809999999999974,113.29000000000002,206.41000000000008,219.71000000000004,229.57999999999993,247.60000000000002,254.47000000000003,262.18999999999994,166.07,166.07,166.07,166.07]
[150,77.330000000000013,114.05000000000001,207.78999999999996,221.17999999999995,231.12,249.26,256.17999999999995,263.95000000000005,167.18,167.18,167.18,167.18]

{"sheet":"E2AM","index":14,"n_rows":164,"n_cols":11,"rows_kept":164,"cut":false,"hidden":true,"merged":[]}
[]
[]
[]
[]
[]
[]
[]
[" FedEx 2Day AM"]
["E&I Contract Zone Rates"]
[null,"Guaranteed delivery by 10:30 a.m. by 2nd Day"]
[]
[]
["Weight (in Lbs)",2,3,4,5,6,7,8,9,"Zones 11 & 12","Zones 13 & 16"]
[0.5,9.1900000000000013,9.4400000000000013,9.8499999999999979,10.94,13.430000000000001,14.180000000000001,14.459999999999999,21.69,"***",12.929999999999998]
[1,9.6700000000000017,9.9300000000000015,10.360000000000003,11.5,14.120000000000001,14.91,15.209999999999999,22.810000000000002,"**",13.6]
[2,9.77,10.129999999999999,10.559999999999999,12.260000000000002,15.64,17.169999999999998,18.060000000000002,25.47,"**",14.850000000000001]
[3,9.8699999999999974,10.45,11.18,13.500000000000002,17.96,19.89,20.71,29.07,"**",17.309999999999999]
[4,10.159999999999998,10.82,12.1,15.77,20.75,22.71,23.560000000000002,30.970000000000002,"**",20.190000000000001]
[5,10.45,11.18,13.139999999999999,17.5,23.169999999999998,25.3,26.81,33.659999999999997,"**",22.02]
[6,10.919999999999998,11.61,14.319999999999999,19.110000000000003,25.76,28.120000000000005,29.370000000000005,35.79,"**",25.209999999999997]
[7,11.37,12.719999999999999,15.540000000000001,20.880000000000003,28.97,31.200000000000003,32.35,38.580000000000005,"**",27.79]
[8,11.830000000000002,13.86,16.619999999999997,22.78,32.06,34.379999999999995,35.6,40.509999999999991,"**",28.65]
[9,12.450000000000001,14.490000000000002,17.96,24.45,34.870000000000005,37.69,39.070000000000007,43.359999999999992,"**",29.76]
[10,13.05,15.439999999999998,19.34,26.119999999999997,37.22999999999999,41.000000000000007,42.25,47.030000000000008,"**",31.400000000000002]
[11,13.630000000000003,16.259999999999998,20.22,27.92,40.18,43.95,45.79,49.849999999999994,"**",31.99]
[12,14.360000000000001,17.21,21.34,29.5,43.3,47.129999999999995,48.929999999999993,51.650000000000006,"**",32.149999999999991]
[13,15.37,18.089999999999996,22.159999999999997,31.27,46.110000000000007,49.419999999999995,51.779999999999994,53.49,"**",32.25]
[14,16.13,19.04,23.599999999999998,33.070000000000007,48.929999999999993,52.01,54.110000000000007,55.589999999999996,"**",32.35]
[15,16.75,19.5,24.739999999999995,34.349999999999994,51.52,54.31,56.57,58.150000000000006,"**",33.86]
[16,17.14,20.16,25.830000000000002,35.47,53.79,57.1,58.96,60.53,"**",34.680000000000007]
[17,17.659999999999997,20.75,26.940000000000005,37.169999999999995,56.21,60.140000000000008,61.709999999999994,63.42,"**",36.049999999999997]
[18,18.260000000000002,21.439999999999998,27.92,38.450000000000003,58.540000000000006,62.800000000000004,65.319999999999993,67.19,"**",37.100000000000009]
[19,18.979999999999997,22.02,28.75,40.019999999999996,60.670000000000009,65.680000000000007,67.48,69.39,"**",38.22]
[20,19.629999999999995,22.980000000000004,29.860000000000003,41.889999999999993,62.830000000000005,67.94,70.009999999999991,71.84,"**",39.36]
[21,20.549999999999997,23.86,30.970000000000002,43.3,65.06,70.27000000000001,73.22,75.19,"**",39.460000000000008]
[22,21.18,25.009999999999998,31.819999999999997,44.510000000000005,67.19,72.960000000000008,75.94,78.039999999999992,"**",41.989999999999995]
[23,21.7,25.560000000000002,32.97,45.79,69.609999999999985,75.349999999999994,78.759999999999991,80.92,"**",42.08]
[24,22.19,26.580000000000002,34.019999999999996,47.560000000000009,72.14,78.300000000000011,81.580000000000013,83.84,"**",42.18]
[25,22.909999999999997,27.34,34.680000000000007,49.2,74.499999999999986,81.049999999999983,84.36999999999999,86.789999999999992,"**",45.53]
[26,23.599999999999998,28.09,35.959999999999994,50.8,77.02,83.84,86.69,89.049999999999983,"**",45.620000000000005]
[27,24.349999999999998,28.91,36.869999999999997,52.610000000000007,79.649999999999991,86.66,89.410000000000011,91.94,"**",45.719999999999992]
[28,25.14,29.860000000000003,37.720000000000006,53.85,81.679999999999993,88.89,91.58,94.88000000000001,"**",47.69]
[29,25.830000000000002,30.419999999999998,38.840000000000003,55.129999999999995,83.869999999999976,91.11,94.300000000000011,97.28,"**",47.790000000000006]
[30,26.29,31.24,40.18,56.929999999999993,86.169999999999987,93.57,96.69,100.36,"**",48.67]
[31,27.07,32.28,41.260000000000005,58.210000000000008,88.13000000000001,95.609999999999985,99.279999999999987,102.82,"**",49.91]
[32,27.47,33,42.439999999999991,59.620000000000005,90.72,98.259999999999991,101.67,106.08999999999999,"**",51.33]
[33,28.25,33.86,43.620000000000005,60.900000000000006,93.149999999999991,100.52,104.25999999999999,108.91,"**",52.38]
[34,29.139999999999997,34.480000000000004,44.54,63.019999999999996,95.970000000000013,103.01,106.80999999999999,111.78999999999999,"**",54.930000000000007]
[35,29.729999999999997,35.53,45.49,64.27000000000001,98.85,105.60000000000001,109.43,114.83999999999999,"**",55.030000000000008]
[36,30.19,36.31,46.440000000000005,65.580000000000013,101.51000000000002,108.94,112.25999999999999,117.49999999999999,"**",55.75]
[37,30.749999999999996,36.839999999999996,47.560000000000009,67.289999999999992,104.25999999999999,111.83,115.20000000000002,120.52000000000001,"**",57.190000000000005]
[38,31.27,37.4,48.77,68.63,106.91,114.75,118.35,123.3,"**",58.08]
[39,32.25,38.379999999999995,49.59,70.009999999999991,109.50000000000001,117.8,121.42999999999999,126.25000000000001,"**",59.29]
[40,33.070000000000007,39.400000000000006,50.769999999999996,71.58,111.99,120.67999999999999,124.12,128.76999999999998,"**",60.169999999999995]
[41,33.92,40.340000000000003,51.359999999999992,72.889999999999986,114.52,123.83000000000001,127.46000000000001,131.59000000000003,"**",61.62]
[42,34.480000000000004,41.330000000000005,52.41,74.430000000000007,116.98,126.87000000000002,130.67000000000002,134.61000000000001,"**",66.56]
[43,35.200000000000003,42.18,53.189999999999991,75.680000000000007,119.73000000000002,129.23000000000002,133.4,137.10000000000002,"**",68.699999999999989]
[44,35.89,42.7,54.410000000000004,77.02,122.05,131.43,136.01999999999998,139.82,"**",68.789999999999992]
[45,35.959999999999994,43.750000000000007,55.19,78.100000000000009,124.27999999999999,133.88999999999999,138.05000000000001,141.85000000000002,"**",68.900000000000006]
[46,37.07,44.249999999999993,56.310000000000009,79.28,126.38,136.05000000000001,141.38999999999999,145.29000000000002,"**",68.990000000000009]
[47,37.849999999999994,45.13000000000001,57.290000000000006,80.400000000000006,128.84,138.15000000000003,144.14999999999998,148.10999999999996,"**",69.09]
[48,38.61,46.22,58.279999999999994,81.580000000000013,131.13,140.5,146.6,150.57000000000002,"**",70.859999999999985]
[49,39.400000000000006,47.260000000000005,59.33,83.02000000000001,133.36000000000001,142.57,149.32000000000002,153.39000000000004,"**",70.959999999999994]
[50,39.950000000000003,47.85,60.209999999999994,84.39,135.65,144.72999999999999,151.72000000000003,153.46000000000004,"**",75.149999999999991]
[51,40.539999999999992,48.410000000000004,61.26,85.64,137.88,144.80000000000001,154.33999999999997,158.60000000000002,"**",75.29000000000002]
[52,41.000000000000007,49.129999999999995,62.34,87.67,139.98000000000002,150.08000000000004,157.02000000000004,158.95999999999998,"**",75.38]
[53,41.820000000000007,50.11,63.22,88.980000000000018,142.11000000000001,152.69999999999999,158.95999999999998,160.80000000000001,"**",77.87]
[54,42.41,50.94,64.2,90.36,144.51,155.71,161.38,163.34999999999997,"**",77.97]
[55,43.2,51.819999999999993,64.930000000000007,90.529999999999987,147.06,158.67000000000002,163.73999999999998,166.50000000000003,"**",78.069999999999993]
[56,43.879999999999995,52.47,65.03,90.59,147.13,158.73000000000002,166.65999999999997,168.58999999999997,"**",79.02]
[57,44.41,53.32,66.960000000000008,94.789999999999992,151.91,163.91,169.77,171.74,"**",80.039999999999992]
[58,45.23,54.239999999999995,68.169999999999987,96.390000000000015,154.79,166.65999999999997,172.35999999999999,174.32999999999998,"**",81.81]
[59,45.79,54.900000000000006,69.48,96.46,157.68,169.38000000000002,175.14999999999998,177.15000000000003,"**",82.919999999999987]
[60,45.849999999999994,55.390000000000008,70.599999999999994,99.5,160.42999999999998,172.27000000000004,177.34,179.38,"**",84.89]
[61,47.099999999999994,56.14,71.420000000000016,99.57,160.5,172.32999999999998,177.64,179.68000000000004,"**",84.99]
[62,47.66,57.230000000000004,71.47999999999999,99.640000000000015,160.56,172.42999999999998,177.70999999999998,182.53000000000003,"**",86.530000000000015]
[63,47.72,58.11,71.55,101.83000000000001,167.51,180.13,186.95000000000002,189.08000000000004,"**",87.41]
[64,47.790000000000006,58.7,71.650000000000006,101.9,169.97,183.04999999999998,187.02,189.14,"**",91.38]
[65,50.339999999999996,59.91,75.29000000000002,105.05,171.84000000000003,186.10000000000002,192.62,192.65,"**",91.469999999999985]
[66,50.959999999999994,60.470000000000006,76.329999999999984,105.11,171.90999999999997,188.46,192.68,194.91,"**",91.58]
[67,51.43,61.69,76.400000000000006,106.80999999999999,172,190.16,192.75000000000003,194.98,"**",92.59]
[68,52.050000000000004,62.18,78.66,108.67999999999999,174.3,190.23000000000002,195.11,200.71,"**",94.070000000000007]
[69,52.900000000000006,62.76,78.73,110.68,176.42999999999998,190.29000000000002,198.51999999999998,200.78,"**",95.54000000000002]
[70,53.719999999999992,64.05,80.92,115.69999999999999,184.32999999999998,198.88000000000002,207.20999999999998,209.76,"**",96.589999999999989]
[71,54.18,64.930000000000007,80.990000000000009,115.76,184.39,198.94999999999996,207.26999999999998,209.83,"**",97.93]
[72,54.239999999999995,65.62,82.170000000000016,115.83000000000001,189.41000000000003,203.27,208.41,210.83999999999997,"**",98.98]
[73,54.31,65.680000000000007,82.230000000000018,117.8,190.95,203.34000000000003,208.48,210.91,"**",100.82000000000001]
[74,54.37,65.75,82.3,119.30000000000001,191.01000000000002,203.40000000000003,211.93,211.95000000000002,"**",101.86000000000001]
[75,56.54,67.610000000000014,83.280000000000015,120.87,191.08,206.03,214.60999999999999,217.07,"**",103.11]
[76,56.599999999999994,67.679999999999993,84.260000000000019,120.94000000000001,194.78000000000003,211.93,219.72000000000003,219.79000000000002,"**",106.23000000000002]
[77,56.67,67.739999999999995,85.179999999999993,121.00999999999999,194.84999999999997,212.02000000000004,219.81999999999996,220.41,"**",107.47]
[78,57.190000000000005,68.3,85.28,121.07,194.91,212.08999999999997,219.89,221.39000000000001,"**",108.91]
[79,58.769999999999996,71.710000000000008,88.46,128.76999999999998,205.47000000000003,227.13000000000002,228.46999999999997,228.51,"**",110.45]
[80,58.829999999999991,72.5,88.53,128.84,207.91999999999996,227.2,235.92,235.95,"**",113.85999999999999]
[81,59.349999999999994,72.569999999999993,88.66,128.91000000000003,207.98999999999998,227.26,235.98,236.01,"**",113.96000000000001]
[82,59.95,74.3,90.98,133.63,208.09,227.32999999999998,238.9,238.93,"**",114.05999999999999]
[83,61.09,74.37,93.57,133.69,214.87000000000003,234.77,240.76999999999998,240.79999999999998,"**",115.46]
[84,61.16,74.45999999999998,93.64,133.76,214.93999999999997,234.83,246.82999999999998,246.85999999999999,"**",116.75]
[85,64.2,76.169999999999987,94.559999999999988,138.15000000000003,215,234.90000000000003,246.89999999999998,246.92999999999998,"**",125.49999999999999]
[86,65.09,77.180000000000007,95.54000000000002,138.20999999999998,215.07,234.97000000000003,246.95999999999998,246.98999999999998,"**",125.59]
[87,65.55,78.73,96.85,138.28,215.14000000000001,235.05999999999997,247.06,247.09,"**",125.69]
[88,66.110000000000014,79.12,97.34,138.38,215.20000000000002,235.13,251.35000000000002,251.39,"**",131.1]
[89,66.900000000000006,80.199999999999989,97.9,138.44,217.85,241.15999999999997,252.07000000000002,257.71000000000004,"**",131.19999999999999]
[90,66.960000000000008,80.56,97.97,138.51,229.39,255.25,256.33,257.77999999999997,"**",132.54000000000002]
[91,67.03,80.63,98.029999999999987,138.57,229.46,255.32,256.43,257.87,"**",132.63999999999999]
[92,67.09,81.12,98.13,138.63999999999999,229.56000000000003,255.38000000000002,265.84000000000003,265.87,"**",135.13]
[93,67.849999999999994,82.27000000000001,102.58999999999999,138.69999999999999,229.62000000000003,255.48,266.33000000000004,266.36,"**",135.23000000000002]
[94,68.960000000000008,82.33,102.69000000000001,138.80000000000001,229.68999999999997,255.54999999999998,266.62,266.69,"**",135.32999999999998]
[95,69.03,82.4,102.74999999999999,138.87,229.76,255.60999999999999,266.73,266.75,"**",135.46]
[96,72.099999999999994,82.919999999999987,103.63999999999999,141.45999999999998,237.26000000000002,255.68,277.93000000000006,277.97000000000003,"**",140.80000000000001]
[97,72.83,83.02000000000001,103.7,143.46,246.3,271.84000000000003,278.02999999999997,278.05999999999995,"**",143.19999999999999]
[98,72.889999999999986,83.079999999999984,103.77000000000001,143.51999999999998,246.37,271.89999999999998,278.10000000000002,278.13,"**",143.32999999999998]
[99,73.349999999999994,83.19,106.08999999999999,143.62,246.42999999999998,271.97000000000003,278.15999999999997,278.19,"**",143.42000000000002]
[100,73.53,83.789999999999992,110.01,158.45999999999998,256.5,272.46000000000004,285.57,287.27999999999997,"**",151.62]
[101,74.269999999999982,84.63,111.11000000000001,160.03999999999996,259.06,275.17999999999995,288.42999999999995,290.15000000000003,"**",153.14000000000004]
[102,75.000000000000014,85.47,112.21000000000001,161.63,261.63,277.90999999999997,291.27999999999997,293.03000000000003,"**",154.64999999999998]
[103,75.740000000000009,86.3,113.30999999999999,163.20999999999998,264.19,280.63,294.14,295.89999999999998,"**",156.17000000000002]
[104,76.47,87.14,114.41,164.8,266.76,283.36,296.98999999999995,298.77,"**",157.68]
[105,77.20999999999998,87.97999999999999,115.51,166.38,269.32,286.08,299.84999999999997,301.64000000000004,"**",159.20000000000002]
[106,77.940000000000012,88.82,116.61000000000001,167.97000000000003,271.89,288.81,302.69999999999993,304.52,"**",160.71999999999997]
[107,78.680000000000007,89.66,117.71,169.54999999999998,274.45,291.52999999999997,305.56000000000006,307.39,"**",162.23000000000002]
[108,79.41,90.49,118.81,171.14000000000001,277.02,294.26,308.42000000000007,310.26000000000005,"**",163.74999999999997]
[109,80.150000000000006,91.329999999999984,119.91000000000001,172.71999999999997,279.58000000000004,296.98,311.27000000000004,313.14,"**",165.26999999999998]
[110,80.88,92.169999999999987,121.01,174.31,282.14999999999998,299.70999999999992,314.13,316.01,"**",166.78000000000003]
[111,81.62,93.009999999999991,122.10999999999999,175.89,284.71000000000004,302.43000000000006,316.98,318.88000000000005,"**",168.3]
[112,82.35,93.839999999999989,123.21,177.48000000000002,287.27999999999997,305.16000000000003,319.84000000000003,321.75,"**",169.81]
[113,83.09,94.68,124.31,179.05999999999997,289.84000000000003,307.88,322.69,324.63,"**",171.32999999999998]
[114,83.82,95.52000000000001,125.41000000000001,180.64000000000001,292.40999999999997,310.59999999999997,325.54999999999995,327.49999999999994,"**",172.85000000000002]
[115,84.56,96.360000000000014,126.50999999999999,182.23,294.97000000000003,313.33000000000004,328.40999999999997,330.37,"**",174.35999999999999]
[116,85.289999999999992,97.200000000000017,127.61,183.81000000000003,297.53999999999996,316.05,331.26,333.24,"**",175.88]
[117,86.03,98.030000000000015,128.71,185.39999999999998,300.10000000000002,318.77999999999997,334.11999999999995,336.11999999999995,"**",177.40000000000003]
[118,86.77,98.87,129.81,186.98000000000002,302.66999999999996,321.5,336.96999999999991,338.99,"**",178.91]
[119,87.499999999999986,99.710000000000008,130.90999999999997,188.57,305.23,324.23,339.83000000000004,341.86,"**",180.43]
[120,88.240000000000009,100.55000000000001,132.01,190.15000000000003,307.8,326.95000000000005,342.68000000000006,344.73999999999995,"**",181.94]
[121,88.97,101.39,133.11000000000001,191.74,310.36,329.68,345.54,347.61,"**",183.46]
[122,89.71,102.22,134.21,193.32000000000002,312.93,332.4,348.40000000000003,350.48,"**",184.98]
[123,90.439999999999984,103.06,135.31,194.91,315.49,335.13000000000005,351.25,353.34999999999997,"**",186.49]
[124,91.18,103.9,136.41,196.49000000000004,318.06,337.85,354.11,356.23,"**",188.00999999999996]
[125,91.91,104.74,137.51,198.07,320.62,340.57,356.96,359.1,"**",189.52]
[126,92.649999999999991,105.58,138.61000000000001,199.65999999999997,323.19,343.29999999999995,359.82,361.96999999999997,"**",191.04000000000002]
[127,93.38000000000001,106.41,139.71,201.24,325.75,346.01999999999992,362.66999999999996,364.85,"**",192.56]
[128,94.12,107.25,140.81,202.82999999999998,328.32,348.75000000000006,365.53,367.72,"**",194.07000000000002]
[129,94.85,108.08999999999999,141.91,204.41,330.88,351.47,368.39,370.59,"**",195.58999999999997]
[130,95.589999999999989,108.92999999999999,143.01,205.99999999999997,333.45,354.2,371.23999999999995,373.46000000000004,"**",197.11]
[131,96.320000000000007,109.75999999999999,144.11000000000001,207.58,336.01,356.91999999999996,374.09999999999997,376.34000000000003,"**",198.61999999999998]
[132,97.06,110.6,145.20999999999998,209.17,338.58000000000004,359.65000000000003,376.95000000000005,379.21,"**",200.14000000000001]
[133,97.789999999999992,111.44,146.31,210.75,341.14,362.37,379.81000000000006,382.08000000000004,"**",201.64999999999998]
[134,98.530000000000015,112.27999999999999,147.41000000000003,212.33999999999997,343.71,365.09999999999997,382.66,384.96000000000004,"**",203.17]
[135,99.27000000000001,113.11999999999999,148.51,213.92000000000002,346.27,367.81999999999994,385.52000000000004,387.83,"**",204.69000000000003]
[136,100,113.94999999999999,149.61000000000001,215.51,348.84,370.55000000000007,388.38,390.70000000000005,"**",206.2]
[137,100.74,114.78999999999999,150.71000000000004,217.09,351.4,373.27000000000004,391.23,393.57,"**",207.72000000000003]
[138,101.47000000000001,115.63000000000001,151.80999999999997,218.67,353.97,375.99,394.09,396.45,"**",209.23999999999998]
[139,102.21000000000001,116.47000000000001,152.90999999999997,220.26000000000002,356.53,378.71999999999997,396.94,399.31999999999994,"**",210.75]
[140,102.94,117.31000000000002,154.01,221.83999999999997,359.1,381.44000000000005,399.79999999999995,402.19,"**",212.26999999999998]
[141,103.67999999999999,118.14000000000001,155.11000000000001,223.43,361.66,384.17,402.65,405.06,"**",213.78]
[142,104.41000000000001,118.98,156.21,225.01,364.23,386.89,405.50999999999993,407.93999999999994,"**",215.30000000000004]
[143,105.15,119.82000000000001,157.31,226.60000000000002,366.79,389.61999999999995,408.36999999999995,410.81,"**",216.82]
[144,105.88,120.66000000000001,158.41000000000003,228.18,369.36,392.34000000000003,411.22,413.68,"**",218.33]
[145,106.62,121.5,159.51000000000002,229.77,371.92,395.07000000000005,414.08000000000004,416.55999999999995,"**",219.85]
[146,107.35000000000001,122.33,160.60999999999996,231.35,374.49,397.79,416.93000000000006,419.43,"**",221.37]
[147,108.08999999999999,123.17,161.70999999999998,232.94000000000003,377.05,400.52,419.79,422.3,"**",222.88]
[148,108.82,124.01,162.81,234.52,379.62,403.24000000000007,422.64000000000004,425.16999999999996,"**",224.4]
[149,109.56,124.85,163.91,236.11,382.18,405.97,425.5,428.05,"**",225.90999999999997]
[150,110.29,125.68,165.01,237.69,384.75,408.69,428.35,430.92,"**",227.43]

{"sheet":"E2 E&I","index":15,"n_rows":166,"n_cols":16,"rows_kept":166,"cut":false,"hidden":true,"merged":[]}
[]
[]
[]
[]
[]
[]
[]
[" FedEx 2Day"]
["E&I Contract Zone Rates"]
[null,"Guaranteed delivery by 4:30 p.m. by 2nd Day"]
[]
[]
["Weight (in Lbs)",2,3,4,5,6,7,8,8,10,11,12,13,14,15,16]
[0.5,6.82,6.82,6.82,6.9300000000000015,8.5100000000000016,8.99,9.16,13.749999999999996,13.749999999999996,17.789999999999996,17.789999999999996,8.1999999999999993,8.1999999999999993,8.1999999999999993,8.1999999999999993]
["PAK1",0,0,0,0,0,0,0,0,0,0,0,0,0,0,0]
["PAK2",0,0,0,0,0,0,0,0,0,0,0,0,0,0,0]
[1,6.82,6.82,6.82,6.82,8.33,8.7899999999999991,8.9699999999999989,13.449999999999996,13.449999999999996,17.409999999999997,17.409999999999997,8.02,8.02,8.02,8.02]
[2,6.82,6.82,6.82,7.2299999999999986,9.2200000000000006,10.129999999999999,10.650000000000002,15.020000000000003,15.020000000000003,20.810000000000002,20.810000000000002,8.7499999999999982,8.7499999999999982,8.7499999999999982,8.7499999999999982]
[3,6.82,6.82,6.82,7.9600000000000009,10.59,11.73,12.21,17.14,17.14,21.64,21.64,10.199999999999999,10.199999999999999,10.199999999999999,10.199999999999999]
[4,6.82,6.82,7.129999999999999,9.3000000000000007,12.229999999999997,13.389999999999997,13.890000000000004,18.260000000000002,18.260000000000002,22.590000000000003,22.590000000000003,11.900000000000002,11.900000000000002,11.900000000000002,11.900000000000002]
[5,6.82,6.82,7.75,10.32,13.66,14.920000000000002,15.809999999999999,19.850000000000001,19.850000000000001,23.380000000000003,23.380000000000003,12.990000000000002,12.990000000000002,12.990000000000002,12.990000000000002]
[6,6.82,6.84,8.4500000000000011,11.27,15.189999999999998,16.579999999999998,17.319999999999997,21.1,21.1,24.659999999999997,24.659999999999997,14.860000000000003,14.860000000000003,14.860000000000003,14.860000000000003]
[7,6.82,7.4999999999999982,9.16,12.310000000000002,17.080000000000002,18.400000000000002,19.07,22.75,22.75,25.739999999999995,25.739999999999995,16.389999999999997,16.389999999999997,16.389999999999997,16.389999999999997]
[8,6.98,8.1699999999999982,9.8000000000000007,13.43,18.899999999999999,20.270000000000003,20.989999999999995,23.89,23.89,26.979999999999997,26.979999999999997,16.890000000000004,16.890000000000004,16.890000000000004,16.890000000000004]
[9,7.34,8.5400000000000009,10.59,14.419999999999998,20.560000000000002,22.22,23.04,25.570000000000007,25.570000000000007,28.409999999999997,28.409999999999997,17.549999999999997,17.549999999999997,17.549999999999997,17.549999999999997]
[10,7.6899999999999977,9.1000000000000014,11.399999999999999,15.400000000000002,21.949999999999996,24.18,24.910000000000004,27.729999999999997,27.729999999999997,29.609999999999992,29.609999999999992,18.509999999999998,18.509999999999998,18.509999999999998,18.509999999999998]
[11,8.0400000000000009,9.59,11.920000000000002,16.46,23.689999999999998,25.909999999999997,26.999999999999993,29.39,29.39,30.379999999999995,30.379999999999995,18.859999999999996,18.859999999999996,18.859999999999996,18.859999999999996]
[12,8.4599999999999991,10.149999999999999,12.579999999999998,17.39,25.529999999999994,27.790000000000006,28.850000000000009,30.459999999999994,30.459999999999994,31.619999999999997,31.619999999999997,18.959999999999997,18.959999999999997,18.959999999999997,18.959999999999997]
[13,9.0599999999999987,10.670000000000002,13.059999999999999,18.440000000000001,27.189999999999998,29.140000000000008,30.53,31.539999999999992,31.539999999999992,32.520000000000003,32.520000000000003,19.020000000000003,19.020000000000003,19.020000000000003,19.020000000000003]
[14,9.5100000000000016,11.23,13.91,19.500000000000004,28.850000000000009,30.669999999999995,31.909999999999997,32.779999999999994,32.779999999999994,33.800000000000004,33.800000000000004,19.07,19.07,19.07,19.07]
[15,9.8800000000000008,11.5,14.59,20.25,30.379999999999995,32.019999999999996,33.349999999999994,34.28,34.28,35.64,35.64,19.959999999999997,19.959999999999997,19.959999999999997,19.959999999999997]
[16,10.11,11.879999999999999,15.229999999999997,20.910000000000004,31.709999999999994,33.659999999999997,34.770000000000003,35.69,35.69,37.650000000000006,37.650000000000006,20.449999999999996,20.449999999999996,20.449999999999996,20.449999999999996]
[17,10.419999999999998,12.229999999999997,15.89,21.910000000000004,33.14,35.46,36.390000000000008,37.39,37.39,39.190000000000005,39.190000000000005,21.259999999999998,21.259999999999998,21.259999999999998,21.259999999999998]
[18,10.760000000000002,12.640000000000004,16.46,22.67,34.51,37.029999999999994,38.510000000000005,39.619999999999997,39.619999999999997,40.760000000000005,40.760000000000005,21.880000000000003,21.880000000000003,21.880000000000003,21.880000000000003]
[19,11.189999999999998,12.990000000000002,16.950000000000003,23.599999999999994,35.769999999999996,38.730000000000004,39.790000000000006,40.909999999999997,40.909999999999997,42.86,42.86,22.529999999999994,22.529999999999994,22.529999999999994,22.529999999999994]
[20,11.579999999999998,13.549999999999997,17.609999999999996,24.699999999999996,37.049999999999997,40.06,41.28,42.36,42.36,44.36999999999999,44.36999999999999,23.209999999999994,23.209999999999994,23.209999999999994,23.209999999999994]
[21,12.120000000000001,14.07,18.260000000000002,25.529999999999994,38.36,41.430000000000007,43.17,44.33,44.33,46.440000000000012,46.440000000000012,23.270000000000003,23.270000000000003,23.270000000000003,23.270000000000003]
[22,12.479999999999997,14.739999999999998,18.759999999999998,26.240000000000009,39.619999999999997,43.019999999999996,44.78,46.009999999999991,46.009999999999991,48.25,48.25,24.759999999999998,24.759999999999998,24.759999999999998,24.759999999999998]
[23,12.790000000000003,15.07,19.439999999999998,26.999999999999993,41.05,44.430000000000007,46.440000000000012,47.710000000000008,47.710000000000008,49.899999999999991,49.899999999999991,24.810000000000002,24.810000000000002,24.810000000000002,24.810000000000002]
[24,13.080000000000002,15.669999999999998,20.059999999999999,28.04,42.53,46.17,48.100000000000009,49.430000000000007,49.430000000000007,51.660000000000011,51.660000000000011,24.869999999999997,24.869999999999997,24.869999999999997,24.869999999999997]
[25,13.510000000000002,16.120000000000005,20.449999999999996,29.009999999999998,43.930000000000007,47.790000000000006,49.739999999999995,51.17,51.17,53.450000000000017,53.450000000000017,26.840000000000003,26.840000000000003,26.840000000000003,26.840000000000003]
[26,13.91,16.560000000000002,21.200000000000003,29.950000000000003,45.41,49.430000000000007,51.11,52.509999999999991,52.509999999999991,55.100000000000009,55.100000000000009,26.899999999999991,26.899999999999991,26.899999999999991,26.899999999999991]
[27,14.36,17.040000000000003,21.740000000000002,31.020000000000003,46.959999999999994,51.099999999999994,52.72,54.209999999999994,54.209999999999994,56.759999999999991,56.759999999999991,26.96,26.96,26.96,26.96]
[28,14.82,17.609999999999996,22.239999999999995,31.750000000000007,48.16,52.41,53.989999999999995,55.95,55.95,58.77000000000001,58.77000000000001,28.119999999999997,28.119999999999997,28.119999999999997,28.119999999999997]
[29,15.229999999999997,17.93,22.9,32.499999999999993,49.45,53.72,55.599999999999994,57.36,57.36,60.410000000000011,60.410000000000011,28.180000000000007,28.180000000000007,28.180000000000007,28.180000000000007]
[30,15.5,18.419999999999998,23.689999999999998,33.569999999999993,50.809999999999988,55.17,57.010000000000005,59.169999999999987,59.169999999999987,61.960000000000008,61.960000000000008,28.700000000000003,28.700000000000003,28.700000000000003,28.700000000000003]
[31,15.959999999999997,19.04,24.330000000000005,34.32,51.959999999999994,56.36999999999999,58.539999999999992,60.61999999999999,60.61999999999999,63.830000000000013,63.830000000000013,29.430000000000007,29.430000000000007,29.430000000000007,29.430000000000007]
[32,16.189999999999998,19.46,25.03,35.150000000000006,53.490000000000009,57.940000000000012,59.949999999999989,62.559999999999988,62.559999999999988,65.530000000000015,65.530000000000015,30.259999999999998,30.259999999999998,30.259999999999998,30.259999999999998]
[33,16.66,19.959999999999997,25.72,35.910000000000004,54.919999999999987,59.269999999999996,61.470000000000013,64.22,64.22,67.170000000000016,67.170000000000016,30.880000000000003,30.880000000000003,30.880000000000003,30.880000000000003]
[34,17.180000000000003,20.329999999999998,26.260000000000005,37.160000000000004,56.580000000000013,60.740000000000009,62.97999999999999,65.920000000000016,65.920000000000016,68.929999999999993,68.929999999999993,32.39,32.39,32.39,32.39]
[35,17.53,20.950000000000003,26.820000000000007,37.9,58.280000000000015,62.269999999999996,64.529999999999987,67.709999999999994,67.709999999999994,70.83,70.83,32.450000000000003,32.450000000000003,32.450000000000003,32.450000000000003]
[36,17.799999999999997,21.409999999999997,27.379999999999995,38.669999999999995,59.849999999999994,64.239999999999995,66.19,69.28,69.28,72.349999999999994,72.349999999999994,32.869999999999997,32.869999999999997,32.869999999999997,32.869999999999997]
[37,18.13,21.720000000000006,28.04,39.670000000000009,61.470000000000013,65.94,67.930000000000007,71.059999999999988,71.059999999999988,74.38,74.38,33.72,33.72,33.72,33.72]
[38,18.440000000000001,22.049999999999997,28.760000000000005,40.47,63.039999999999992,67.660000000000011,69.780000000000015,72.699999999999989,72.699999999999989,75.95,75.95,34.239999999999995,34.239999999999995,34.239999999999995,34.239999999999995]
[39,19.020000000000003,22.629999999999995,29.240000000000009,41.28,64.560000000000016,69.449999999999989,71.599999999999994,74.44,74.44,77.740000000000009,77.740000000000009,34.96,34.96,34.96,34.96]
[40,19.500000000000004,23.230000000000004,29.93,42.210000000000008,66.03,71.149999999999991,73.179999999999993,75.929999999999993,75.929999999999993,79.599999999999994,79.599999999999994,35.479999999999997,35.479999999999997,35.479999999999997,35.479999999999997]
[41,20,23.79,30.279999999999994,42.980000000000004,67.519999999999982,73.010000000000005,75.149999999999991,77.59,77.59,80.310000000000016,80.310000000000016,36.33,36.33,36.33,36.33]
[42,20.329999999999998,24.369999999999997,30.900000000000006,43.89,68.969999999999985,74.810000000000016,77.05,79.36999999999999,79.36999999999999,82.050000000000011,82.050000000000011,39.25,39.25,39.25,39.25]
[43,20.760000000000005,24.869999999999997,31.360000000000007,44.620000000000005,70.59,76.2,78.650000000000006,80.84,80.84,84.06,84.06,40.509999999999991,40.509999999999991,40.509999999999991,40.509999999999991]
[44,21.159999999999997,25.180000000000007,32.08,45.41,71.969999999999985,77.489999999999995,80.2,82.44,82.44,85.47,85.47,40.56,40.56,40.56,40.56]
[45,21.200000000000003,25.799999999999997,32.540000000000006,46.050000000000011,73.28,78.94,81.400000000000006,83.640000000000015,83.640000000000015,87.1,87.1,40.61999999999999,40.61999999999999,40.61999999999999,40.61999999999999]
[46,21.86,26.090000000000003,33.200000000000003,46.75,74.52000000000001,80.220000000000013,83.369999999999976,85.670000000000016,85.670000000000016,88.860000000000014,88.860000000000014,40.680000000000007,40.680000000000007,40.680000000000007,40.680000000000007]
[47,22.32,26.609999999999992,33.780000000000008,47.400000000000006,75.970000000000013,81.449999999999989,84.990000000000009,87.329999999999984,87.329999999999984,90.899999999999977,90.899999999999977,40.740000000000009,40.740000000000009,40.740000000000009,40.740000000000009]
[48,22.759999999999998,27.25,34.360000000000007,48.100000000000009,77.320000000000007,82.85,86.44,88.78,88.78,92.41,92.41,41.78,41.78,41.78,41.78]
[49,23.230000000000004,27.869999999999997,34.979999999999997,48.95,78.63,84.06,88.04000000000002,90.44,90.44,92.449999999999989,92.449999999999989,41.84,41.84,41.84,41.84]
[50,23.560000000000002,28.21,35.499999999999993,49.760000000000005,79.989999999999995,85.34,89.45999999999998,90.47999999999999,90.47999999999999,92.509999999999991,92.509999999999991,44.31,44.31,44.31,44.31]
[51,23.910000000000004,28.539999999999992,36.120000000000005,50.5,81.299999999999983,85.38,91,93.509999999999991,93.509999999999991,94.47999999999999,94.47999999999999,44.39,44.39,44.39,44.39]
[52,24.18,28.970000000000006,36.759999999999991,51.69,82.54000000000002,88.489999999999981,92.59,93.72999999999999,93.72999999999999,94.62,94.62,44.45,44.45,44.45,44.45]
[53,24.659999999999997,29.550000000000004,37.28,52.47,83.79000000000002,90.039999999999992,93.72999999999999,94.81,94.81,95.72,95.72,45.92,45.92,45.92,45.92]
[54,25.010000000000005,30.03,37.86,53.28,85.199999999999989,91.81,95.16,96.32,96.32,97.239999999999981,97.239999999999981,45.97,45.97,45.97,45.97]
[55,25.470000000000006,30.549999999999997,38.279999999999994,53.379999999999995,86.710000000000008,93.550000000000011,96.550000000000011,98.169999999999987,98.169999999999987,99.119999999999976,99.119999999999976,46.03,46.03,46.03,46.03]
[56,25.880000000000003,30.939999999999998,38.340000000000003,53.409999999999982,86.75,93.59,98.27000000000001,99.41,99.41,100.34999999999997,100.34999999999997,46.59,46.59,46.59,46.59]
[57,26.189999999999998,31.439999999999998,39.480000000000004,55.89,89.57,96.640000000000015,100.1,101.25999999999999,101.25999999999999,102.20999999999998,102.20999999999998,47.19,47.19,47.19,47.19]
[58,26.67,31.979999999999997,40.200000000000003,56.830000000000013,91.27000000000001,98.27000000000001,101.63,102.78999999999999,102.78999999999999,104.04999999999998,104.04999999999998,48.239999999999995,48.239999999999995,48.239999999999995,48.239999999999995]
[59,26.999999999999993,32.369999999999997,40.97,56.870000000000005,92.97,99.869999999999976,103.26999999999998,104.44999999999999,104.44999999999999,104.47,104.47,48.89,48.89,48.89,48.89]
[60,27.040000000000006,32.659999999999997,41.63000000000001,58.670000000000016,94.6,101.57000000000002,104.57000000000002,105.76999999999998,105.76999999999998,106.77000000000001,106.77000000000001,50.05,50.05,50.05,50.05]
[61,27.769999999999996,33.100000000000009,42.11,58.710000000000008,94.63,101.60999999999999,104.74000000000001,105.94000000000003,105.94000000000003,107.68000000000004,107.68000000000004,50.11,50.11,50.11,50.11]
[62,28.1,33.739999999999995,42.149999999999991,58.75,94.669999999999987,101.67000000000002,104.78000000000003,107.61999999999998,107.61999999999998,108.65000000000003,108.65000000000003,51.019999999999996,51.019999999999996,51.019999999999996,51.019999999999996]
[63,28.14,34.260000000000005,42.190000000000012,60.039999999999992,98.77000000000001,106.21000000000001,110.22999999999999,111.48999999999998,111.48999999999998,112.54999999999998,112.54999999999998,51.539999999999992,51.539999999999992,51.539999999999992,51.539999999999992]
[64,28.180000000000007,34.61,42.239999999999995,60.079999999999984,100.22,107.93,110.27000000000001,111.52000000000001,111.52000000000001,112.59,112.59,53.88000000000001,53.88000000000001,53.88000000000001,53.88000000000001]
[65,29.68,35.330000000000005,44.39,61.94,101.31999999999996,109.72999999999999,113.57000000000002,113.58999999999997,113.58999999999997,113.60999999999999,113.60999999999999,53.940000000000012,53.940000000000012,53.940000000000012,53.940000000000012]
[66,30.049999999999997,35.65,45.010000000000005,61.97999999999999,101.36000000000001,111.12,113.60999999999999,114.93000000000004,114.93000000000004,116.00999999999999,116.00999999999999,53.989999999999995,53.989999999999995,53.989999999999995,53.989999999999995]
[67,30.32,36.369999999999997,45.05,62.97999999999999,101.41999999999999,112.12000000000003,113.65,114.95999999999998,114.95999999999998,116.05000000000001,116.05000000000001,54.59,54.59,54.59,54.59]
[68,30.690000000000005,36.659999999999997,46.379999999999995,64.080000000000013,102.76999999999998,112.16,115.03999999999996,118.35,118.35,119.69999999999999,119.69999999999999,55.459999999999994,55.459999999999994,55.459999999999994,55.459999999999994]
[69,31.190000000000005,37.01,46.419999999999987,65.259999999999991,104.02999999999997,112.20000000000002,117.05000000000001,118.38000000000002,118.38000000000002,119.74000000000001,119.74000000000001,56.33,56.33,56.33,56.33]
[70,31.67,37.760000000000005,47.710000000000008,68.22,108.67999999999998,117.25999999999999,122.17000000000002,123.68,123.68,124.84,124.84,56.949999999999989,56.949999999999989,56.949999999999989,56.949999999999989]
[71,31.940000000000005,38.279999999999994,47.75,68.259999999999991,108.72,117.30000000000001,122.20999999999998,123.72000000000003,123.72000000000003,124.88000000000002,124.88000000000002,57.740000000000009,57.740000000000009,57.740000000000009,57.740000000000009]
[72,31.979999999999997,38.69,48.449999999999989,68.289999999999992,111.67999999999998,119.85000000000002,122.88999999999999,124.31999999999996,124.31999999999996,125.5,125.5,58.36,58.36,58.36,58.36]
[73,32.019999999999996,38.730000000000004,48.490000000000009,69.449999999999989,112.59,119.88999999999999,122.93,124.36000000000001,124.36000000000001,125.54000000000002,125.54000000000002,59.440000000000012,59.440000000000012,59.440000000000012,59.440000000000012]
[74,32.06,38.769999999999996,48.53,70.34,112.62999999999997,119.93,124.96000000000001,124.97000000000003,124.97000000000003,127.79999999999998,127.79999999999998,60.06,60.06,60.06,60.06]
[75,33.340000000000003,39.870000000000005,49.099999999999994,71.27000000000001,112.66,121.48000000000002,126.53999999999996,127.98999999999998,127.98999999999998,129.21,129.21,60.800000000000011,60.800000000000011,60.800000000000011,60.800000000000011]
[76,33.369999999999997,39.909999999999997,49.680000000000007,71.31,114.84999999999997,124.96000000000001,129.54999999999998,129.59,129.59,129.61000000000001,129.61000000000001,62.63000000000001,62.63000000000001,62.63000000000001,62.63000000000001]
[77,33.410000000000004,39.94,50.22999999999999,71.349999999999994,114.88999999999999,125.00999999999999,129.61000000000001,129.96,129.96,130.49999999999997,130.49999999999997,63.36999999999999,63.36999999999999,63.36999999999999,63.36999999999999]
[78,33.72,40.270000000000003,50.28,71.389999999999986,114.93000000000004,125.05000000000001,129.64999999999998,130.54,130.54,130.56,130.56,64.22,64.22,64.22,64.22]
[79,34.650000000000006,42.28,52.159999999999982,75.929999999999993,121.14999999999998,133.91999999999999,134.71,134.73000000000002,134.73000000000002,139.09999999999997,139.09999999999997,65.13,65.13,65.13,65.13]
[80,34.69,42.75,52.200000000000017,75.970000000000013,122.6,133.96000000000004,139.09999999999997,139.11999999999998,139.11999999999998,139.13999999999999,139.13999999999999,67.139999999999986,67.139999999999986,67.139999999999986,67.139999999999986]
[81,35,42.790000000000006,52.269999999999996,76.010000000000005,122.64000000000001,134,139.13999999999999,139.16000000000003,139.16000000000003,139.18000000000004,139.18000000000004,67.19,67.19,67.19,67.19]
[82,35.35,43.809999999999988,53.650000000000006,78.789999999999992,122.69,134.04000000000002,140.85999999999999,140.88,140.88,140.9,140.9,67.25,67.25,67.25,67.25]
[83,36.020000000000003,43.850000000000009,55.17,78.829999999999984,126.69,138.41999999999999,141.96,141.98000000000002,141.98000000000002,141.99999999999997,141.99999999999997,68.080000000000013,68.080000000000013,68.080000000000013,68.080000000000013]
[84,36.059999999999995,43.91,55.209999999999994,78.87,126.72999999999999,138.46,145.54000000000002,145.56000000000003,145.56000000000003,145.57999999999998,145.57999999999998,68.839999999999989,68.839999999999989,68.839999999999989,68.839999999999989]
[85,37.86,44.91,55.75,81.449999999999989,126.77000000000001,138.50000000000003,145.57999999999998,145.58999999999997,145.58999999999997,145.61000000000001,145.61000000000001,73.999999999999986,73.999999999999986,73.999999999999986,73.999999999999986]
[86,38.379999999999995,45.510000000000005,56.33,81.489999999999981,126.81000000000003,138.54,145.61000000000001,145.63000000000002,145.63000000000002,145.66999999999999,145.66999999999999,74.05,74.05,74.05,74.05]
[87,38.65,46.419999999999987,57.11,81.53,126.85,138.60000000000002,145.66999999999999,145.69,145.69,145.71,145.71,74.11,74.11,74.11,74.11]
[88,38.979999999999997,46.650000000000006,57.400000000000006,81.59,126.89000000000001,138.63999999999999,148.19999999999999,148.22,148.22,148.24,148.24,77.3,77.3,77.3,77.3]
[89,39.44,47.289999999999992,57.72,81.63,128.45000000000002,142.18999999999997,148.63000000000002,151.94999999999999,151.94999999999999,151.97,151.97,77.36,77.36,77.36,77.36]
[90,39.480000000000004,47.5,57.759999999999991,81.670000000000016,135.26,150.49999999999997,151.14000000000001,151.99,151.99,152.01000000000002,152.01000000000002,78.149999999999991,78.149999999999991,78.149999999999991,78.149999999999991]
[91,39.520000000000003,47.540000000000006,57.800000000000011,81.710000000000008,135.29000000000002,150.54,151.19999999999999,152.04999999999998,152.04999999999998,152.07,152.07,78.209999999999994,78.209999999999994,78.209999999999994,78.209999999999994]
[92,39.559999999999995,47.83,57.859999999999985,81.740000000000009,135.35,150.58000000000001,156.75,156.76000000000002,156.76000000000002,156.79999999999998,156.79999999999998,79.680000000000007,79.680000000000007,79.680000000000007,79.680000000000007]
[93,40,48.510000000000005,60.489999999999995,81.78,135.39000000000001,150.63999999999999,157.03,157.05000000000001,157.05000000000001,157.06999999999996,157.06999999999996,79.730000000000018,79.730000000000018,79.730000000000018,79.730000000000018]
[94,40.659999999999997,48.539999999999992,60.550000000000011,81.84,135.42999999999998,150.68000000000004,157.21,157.25000000000003,157.25000000000003,157.26999999999998,157.26999999999998,79.789999999999992,79.789999999999992,79.789999999999992,79.789999999999992]
[95,40.700000000000003,48.58,60.58,81.88,135.47,150.72,157.26999999999998,157.29,157.29,157.31,157.31,79.87,79.87,79.87,79.87]
[96,42.510000000000005,48.89,61.11,83.410000000000025,139.88999999999999,150.75,163.88,163.90000000000003,163.90000000000003,163.91000000000003,163.91000000000003,83.02000000000001,83.02000000000001,83.02000000000001,83.02000000000001]
[97,42.94,48.95,61.139999999999986,84.59,145.22999999999999,160.28,163.92999999999995,163.95,163.95,163.97000000000003,163.97000000000003,84.429999999999978,84.429999999999978,84.429999999999978,84.429999999999978]
[98,42.980000000000004,48.989999999999995,61.180000000000007,84.619999999999976,145.27000000000001,160.32000000000002,163.97000000000003,163.99,163.99,164.01000000000005,164.01000000000005,84.510000000000019,84.510000000000019,84.510000000000019,84.510000000000019]
[99,43.25,49.050000000000011,62.559999999999988,84.68,145.29999999999998,160.35999999999999,164.01000000000005,164.02999999999997,164.02999999999997,164.05,164.05,84.570000000000022,84.570000000000022,84.570000000000022,84.570000000000022]
[100,43.290000000000006,49.09,64.55,93.15,151.12,160.4,168.13,169.29000000000002,169.29000000000002,170.45,170.45,89.28,89.28,89.28,89.28]
[101,43.72,49.580000000000013,65.189999999999984,94.079999999999984,152.63000000000002,162,169.81,170.98000000000002,170.98000000000002,172.15000000000003,172.15000000000003,90.170000000000016,90.170000000000016,90.170000000000016,90.170000000000016]
[102,44.149999999999991,50.069999999999993,65.84,95.009999999999991,154.13999999999999,163.61000000000001,171.49,172.67000000000002,172.67000000000002,173.86,173.86,91.07,91.07,91.07,91.07]
[103,44.59,50.56,66.47999999999999,95.94,155.66000000000003,165.20999999999998,173.17000000000002,174.37,174.37,175.56,175.56,91.960000000000008,91.960000000000008,91.960000000000008,91.960000000000008]
[104,45.02000000000001,51.050000000000011,67.13000000000001,96.869999999999976,157.16999999999999,166.81,174.84999999999997,176.06,176.06,177.26,177.26,92.850000000000023,92.850000000000023,92.850000000000023,92.850000000000023]
[105,45.449999999999989,51.539999999999992,67.77,97.800000000000011,158.68,168.42000000000002,176.52999999999997,177.75,177.75,178.97000000000003,178.97000000000003,93.75,93.75,93.75,93.75]
[106,45.89,52.03,68.420000000000016,98.740000000000009,160.18999999999997,170.01999999999998,178.22000000000003,179.44,179.44,180.66999999999996,180.66999999999996,94.640000000000015,94.640000000000015,94.640000000000015,94.640000000000015]
[107,46.320000000000007,52.519999999999982,69.06,99.670000000000016,161.69999999999999,171.63,179.89999999999998,181.14000000000004,181.14000000000004,182.38,182.38,95.53,95.53,95.53,95.53]
[108,46.75,53.009999999999991,69.710000000000008,100.59999999999997,163.20999999999998,173.22999999999996,181.57999999999998,182.83000000000004,182.83000000000004,184.07999999999998,184.07999999999998,96.419999999999987,96.419999999999987,96.419999999999987,96.419999999999987]
[109,47.179999999999993,53.5,70.349999999999994,101.53,164.71999999999997,174.83000000000004,183.26,184.52000000000004,184.52000000000004,185.79000000000002,185.79000000000002,97.32,97.32,97.32,97.32]
[110,47.620000000000005,53.989999999999995,70.999999999999986,102.46000000000004,166.23000000000002,176.44,184.94,186.22000000000003,186.22000000000003,187.49,187.49,98.210000000000008,98.210000000000008,98.210000000000008,98.210000000000008]
[111,48.05,54.480000000000004,71.650000000000006,103.38999999999999,167.74,178.03999999999996,186.62,187.91000000000003,187.91000000000003,189.2,189.2,99.100000000000023,99.100000000000023,99.100000000000023,99.100000000000023]
[112,48.480000000000004,54.980000000000004,72.289999999999992,104.32000000000002,169.26,179.65000000000003,188.3,189.60000000000002,189.60000000000002,190.90000000000003,190.90000000000003,100.00000000000003,100.00000000000003,100.00000000000003,100.00000000000003]
[113,48.92,55.469999999999985,72.940000000000012,105.25999999999999,170.76999999999998,181.25,189.98000000000002,191.29000000000002,191.29000000000002,192.59999999999997,192.59999999999997,100.88999999999999,100.88999999999999,100.88999999999999,100.88999999999999]
[114,49.350000000000009,55.960000000000008,73.58,106.19,172.28000000000003,182.85000000000002,191.66999999999996,192.99,192.99,194.31,194.31,101.77999999999997,101.77999999999997,101.77999999999997,101.77999999999997]
[115,49.780000000000015,56.450000000000017,74.230000000000018,107.11999999999998,173.78999999999996,184.45999999999998,193.35000000000002,194.68,194.68,196.01,196.01,102.66999999999999,102.66999999999999,102.66999999999999,102.66999999999999]
[116,50.209999999999994,56.94,74.87,108.05000000000001,175.3,186.06,195.03000000000003,196.37,196.37,197.72000000000003,197.72000000000003,103.57,103.57,103.57,103.57]
[117,50.649999999999991,57.430000000000007,75.519999999999982,108.98000000000002,176.81,187.67000000000002,196.70999999999998,198.07000000000005,198.07000000000005,199.42000000000002,199.42000000000002,104.45999999999998,104.45999999999998,104.45999999999998,104.45999999999998]
[118,51.08,57.920000000000016,76.16,109.91,178.32,189.26999999999998,198.38999999999993,199.76000000000005,199.76000000000005,201.13,201.13,105.35,105.35,105.35,105.35]
[119,51.510000000000005,58.41,76.809999999999988,110.84000000000003,179.83000000000004,190.87,200.07,201.45000000000005,201.45000000000005,202.82999999999998,202.82999999999998,106.23999999999998,106.23999999999998,106.23999999999998,106.23999999999998]
[120,51.95,58.900000000000006,77.45,111.78,181.34999999999997,192.48000000000002,201.75,203.14000000000004,203.14000000000004,204.54000000000002,204.54000000000002,107.13999999999999,107.13999999999999,107.13999999999999,107.13999999999999]
[121,52.38000000000001,59.389999999999986,78.099999999999994,112.71000000000001,182.86,194.07999999999998,203.43,204.84000000000003,204.84000000000003,206.24,206.24,108.03,108.03,108.03,108.03]
[122,52.809999999999988,59.879999999999995,78.750000000000014,113.63999999999999,184.37,195.68,205.12000000000006,206.53000000000003,206.53000000000003,207.94,207.94,108.91999999999999,108.91999999999999,108.91999999999999,108.91999999999999]
[123,53.239999999999995,60.38000000000001,79.39,114.57,185.88,197.28999999999996,206.79999999999995,208.22000000000003,208.22000000000003,209.64999999999998,209.64999999999998,109.82,109.82,109.82,109.82]
[124,53.679999999999993,60.86999999999999,80.040000000000006,115.49999999999997,187.39,198.89000000000004,208.47999999999996,209.92000000000002,209.92000000000002,211.35000000000002,211.35000000000002,110.71000000000001,110.71000000000001,110.71000000000001,110.71000000000001]
[125,54.11,61.36,80.680000000000007,116.43,188.89999999999998,200.5,210.16000000000003,211.61,211.61,213.06,213.06,111.6,111.6,111.6,111.6]
[126,54.540000000000006,61.850000000000009,81.329999999999984,117.36000000000001,190.41000000000003,202.09999999999997,211.84000000000003,213.3,213.3,214.76,214.76,112.49000000000001,112.49000000000001,112.49000000000001,112.49000000000001]
[127,54.980000000000004,62.339999999999989,81.97,118.29999999999998,191.92000000000002,203.69999999999993,213.52000000000004,214.99,214.99,216.47000000000003,216.47000000000003,113.39000000000001,113.39000000000001,113.39000000000001,113.39000000000001]
[128,55.410000000000011,62.83,82.62,119.23000000000002,193.44,205.31000000000006,215.19999999999993,216.69,216.69,218.17000000000002,218.17000000000002,114.28,114.28,114.28,114.28]
[129,55.839999999999989,63.320000000000007,83.260000000000019,120.16,194.95,206.91000000000003,216.88,218.38,218.38,219.88,219.88,115.17000000000002,115.17000000000002,115.17000000000002,115.17000000000002]
[130,56.269999999999996,63.809999999999988,83.91,121.09,196.46000000000004,208.51999999999998,218.57,220.07,220.07,221.57999999999993,221.57999999999993,116.07000000000002,116.07000000000002,116.07000000000002,116.07000000000002]
[131,56.709999999999994,64.300000000000011,84.550000000000011,122.01999999999998,197.97000000000003,210.12,220.25,221.76999999999998,221.76999999999998,223.28000000000003,223.28000000000003,116.96000000000001,116.96000000000001,116.96000000000001,116.96000000000001]
[132,57.14,64.789999999999992,85.199999999999989,122.95000000000002,199.48000000000002,211.71999999999997,221.93000000000006,223.45999999999998,223.45999999999998,224.99,224.99,117.85000000000002,117.85000000000002,117.85000000000002,117.85000000000002]
[133,57.570000000000007,65.28,85.850000000000023,123.87999999999997,200.98999999999995,213.33000000000004,223.60999999999996,225.14999999999998,225.14999999999998,226.69,226.69,118.74000000000001,118.74000000000001,118.74000000000001,118.74000000000001]
[134,58.010000000000019,65.77000000000001,86.490000000000009,124.82,202.50000000000006,214.93,225.28999999999996,226.83999999999997,226.83999999999997,228.40000000000003,228.40000000000003,119.64000000000001,119.64000000000001,119.64000000000001,119.64000000000001]
[135,58.439999999999984,66.269999999999982,87.139999999999986,125.75000000000003,204.01000000000005,216.54000000000002,226.97000000000003,228.53999999999996,228.53999999999996,230.10000000000002,230.10000000000002,120.53000000000003,120.53000000000003,120.53000000000003,120.53000000000003]
[136,58.86999999999999,66.760000000000005,87.78,126.67999999999998,205.52999999999997,218.14,228.65000000000003,230.22999999999996,230.22999999999996,231.81,231.81,121.42000000000002,121.42000000000002,121.42000000000002,121.42000000000002]
[137,59.3,67.250000000000014,88.429999999999978,127.61000000000001,207.03999999999996,219.73999999999995,230.33000000000004,231.91999999999996,231.91999999999996,233.50999999999993,233.50999999999993,122.32000000000002,122.32000000000002,122.32000000000002,122.32000000000002]
[138,59.740000000000009,67.739999999999995,89.070000000000022,128.54,208.55000000000007,221.35000000000002,232.01999999999998,233.62000000000006,233.62000000000006,235.22000000000003,235.22000000000003,123.20999999999998,123.20999999999998,123.20999999999998,123.20999999999998]
[139,60.17,68.23,89.72,129.47,210.06,222.95000000000005,233.7,235.31000000000006,235.31000000000006,236.92000000000002,236.92000000000002,124.09999999999997,124.09999999999997,124.09999999999997,124.09999999999997]
[140,60.600000000000009,68.720000000000013,90.360000000000014,130.40999999999997,211.57,224.56,235.38,237.00000000000006,237.00000000000006,238.63,238.63,124.98999999999998,124.98999999999998,124.98999999999998,124.98999999999998]
[141,61.039999999999992,69.209999999999994,91.009999999999991,131.34,213.07999999999993,226.15999999999997,237.06,238.69000000000005,238.69000000000005,240.32999999999993,240.32999999999993,125.88999999999999,125.88999999999999,125.88999999999999,125.88999999999999]
[142,61.47,69.7,91.649999999999977,132.27000000000004,214.59000000000003,227.75999999999993,238.74000000000007,240.39000000000004,240.39000000000004,242.03000000000003,242.03000000000003,126.77999999999997,126.77999999999997,126.77999999999997,126.77999999999997]
[143,61.899999999999991,70.190000000000012,92.300000000000011,133.19999999999999,216.10000000000002,229.37000000000006,240.41999999999996,242.08000000000004,242.08000000000004,243.74,243.74,127.66999999999999,127.66999999999999,127.66999999999999,127.66999999999999]
[144,62.33,70.679999999999993,92.949999999999989,134.13000000000002,217.60999999999996,230.97000000000003,242.09999999999997,243.77000000000004,243.77000000000004,245.43999999999994,245.43999999999994,128.57,128.57,128.57,128.57]
[145,62.77000000000001,71.17,93.59,135.06,219.13000000000005,232.57999999999998,243.77999999999997,245.47000000000003,245.47000000000003,247.15000000000003,247.15000000000003,129.45999999999998,129.45999999999998,129.45999999999998,129.45999999999998]
[146,63.200000000000017,71.659999999999982,94.239999999999981,135.99,220.64,234.17999999999995,245.47000000000003,247.16000000000003,247.16000000000003,248.85000000000002,248.85000000000002,130.35,130.35,130.35,130.35]
[147,63.629999999999981,72.16,94.88,136.92999999999998,222.14999999999998,235.77999999999997,247.15000000000003,248.85000000000002,248.85000000000002,250.56,250.56,131.23999999999998,131.23999999999998,131.23999999999998,131.23999999999998]
[148,64.069999999999993,72.650000000000006,95.53,137.86000000000001,223.65999999999997,237.39000000000004,248.82999999999993,250.54000000000002,250.54000000000002,252.25999999999993,252.25999999999993,132.13999999999999,132.13999999999999,132.13999999999999,132.13999999999999]
[149,64.5,73.139999999999986,96.170000000000016,138.78999999999996,225.17000000000002,238.99,250.51,252.24,252.24,253.97000000000003,253.97000000000003,133.03,133.03,133.03,133.03]
[150,64.930000000000007,73.63,96.82,139.72,226.68,240.60000000000002,252.19,253.93,253.93,255.67000000000002,255.67000000000002,133.91999999999999,133.91999999999999,133.91999999999999,133.91999999999999]

{"sheet":"ESP E&I","index":16,"n_rows":166,"n_cols":8,"rows_kept":166,"cut":false,"hidden":true,"merged":[]}
[]
[]
[]
[]
[]
[]
[]
[" FedEx Express Saver"]
["E&I Contract Zone Rates"]
[null,"Guaranteed delivery by 4:30 by 3rd Day"]
[]
[]
["Weight (in Lbs)",2,3,4,5,6,7,8]
[0.5,0,0,0,0,0,0,0]
["PAK1",0,0,0,0,0,0,0]
["PAK2",0,0,0,0,0,0,0]
[1,6,6,6,6,6.1399999999999988,6.3900000000000006,7.1600000000000019]
[2,6,6,6,6,6.5399999999999991,7.1199999999999992,8.3200000000000021]
[3,6,6,6.0300000000000011,6.0600000000000005,7.6,7.9699999999999989,9.3899999999999988]
[4,6,6.1,6.5399999999999991,6.8099999999999987,8.4299999999999979,9.11,10.739999999999998]
[5,6,6.2000000000000011,6.91,7.4699999999999989,9.5700000000000021,10.050000000000001,12.05]
[6,6.26,6.7600000000000016,7.8900000000000006,8.35,10.66,11.16,13.71]
[7,6.2900000000000009,7.41,8.5299999999999994,8.9700000000000006,11.86,12.629999999999995,15.029999999999998]
[8,6.5999999999999979,8.1000000000000014,9.1800000000000015,9.64,13.009999999999998,13.82,16.419999999999998]
[9,6.8899999999999988,8.3699999999999992,9.7999999999999989,10.41,13.96,15.169999999999998,17.690000000000001]
[10,6.93,8.4100000000000019,10.34,11.200000000000003,14.82,16.32,19.079999999999998]
[11,7.91,9.51,11.09,11.84,15.82,17.500000000000004,20.440000000000005]
[12,8.08,10.07,11.61,12.529999999999998,16.809999999999999,18.610000000000003,21.6]
[13,8.8199999999999985,10.59,12.189999999999998,13.260000000000002,17.84,19.599999999999998,22.909999999999997]
[14,8.93,11.110000000000003,12.86,14.05,18.750000000000004,20.64,24.1]
[15,9.009999999999998,11.36,13.439999999999998,14.670000000000002,19.770000000000003,21.5,25.449999999999996]
[16,9.51,11.719999999999999,13.900000000000002,15.129999999999995,20.6,22.619999999999997,26.58]
[17,9.82,12.09,14.48,15.860000000000003,21.43,23.75,27.780000000000008]
[18,10.43,12.469999999999999,15.029999999999998,16.46,22.199999999999996,24.83,28.719999999999992]
[19,10.739999999999998,12.899999999999999,15.549999999999997,17.059999999999999,22.950000000000003,25.850000000000009,29.759999999999998]
[20,10.8,13.460000000000004,16.3,17.77,23.79,26.830000000000005,31.029999999999994]
[21,11.529999999999998,13.979999999999997,16.920000000000002,18.360000000000003,24.93,27.780000000000008,32.049999999999997]
[22,11.86,14.649999999999999,17.579999999999998,18.96,25.79,28.78,33.239999999999995]
[23,12.379999999999999,14.979999999999997,18.23,19.520000000000003,26.85,29.720000000000006,34.320000000000007]
[24,12.719999999999999,15.549999999999997,18.689999999999998,20.25,27.739999999999995,30.739999999999995,35.520000000000003]
[25,12.780000000000001,16.020000000000003,19.309999999999999,20.939999999999998,28.529999999999994,31.779999999999994,36.69]
[26,13.589999999999996,16.46,19.939999999999998,21.619999999999997,29.410000000000004,32.880000000000003,37.81]
[27,14.030000000000001,16.859999999999996,20.689999999999998,22.349999999999994,30.180000000000007,34.030000000000008,38.979999999999997]
[28,14.459999999999997,17.38,21.21,22.909999999999997,31.219999999999992,35.069999999999993,40.230000000000004]
[29,14.939999999999998,17.809999999999999,21.830000000000005,23.5,32.15,36.11,41.480000000000004]
[30,14.979999999999997,18.29,22.479999999999997,24.240000000000002,33.170000000000009,37.089999999999996,42.679999999999993]
[31,15.229999999999997,18.829999999999998,22.520000000000003,24.790000000000006,34.19,37.169999999999995,43.83]
[32,15.960000000000004,19.330000000000002,23.810000000000002,25.449999999999996,35.03,39.25,45.08]
[33,16.400000000000002,19.829999999999998,24.330000000000005,26.140000000000008,36.06,40.269999999999996,46.3]
[34,16.730000000000004,20.190000000000005,24.890000000000008,26.779999999999994,36.96,41.209999999999994,47.7]
[35,17.059999999999999,20.809999999999995,25.6,27.449999999999996,37.790000000000006,42.25,48.839999999999989]
[36,17.560000000000002,21.270000000000003,26.199999999999996,28.070000000000007,38.829999999999991,43.120000000000005,49.929999999999993]
[37,17.809999999999999,21.560000000000002,26.659999999999997,28.719999999999992,39.620000000000005,43.989999999999995,51.070000000000007]
[38,17.84,21.619999999999997,27.43,29.389999999999993,40.44,44.86999999999999,52.03]
[39,17.880000000000003,21.659999999999997,27.93,30.049999999999997,41.41,45.680000000000007,53.050000000000011]
[40,17.919999999999998,21.71,27.990000000000002,30.32,42.349999999999994,46.64,54.02000000000001]
[41,19.459999999999997,23.64,28.989999999999995,31.4,43.059999999999988,47.510000000000005,55.170000000000016]
[42,19.810000000000002,24.22,29.64,32.210000000000008,43.989999999999995,48.510000000000005,56.36]
[43,20.190000000000005,24.720000000000006,30.200000000000003,32.800000000000004,44.86999999999999,49.590000000000018,57.670000000000016]
[44,20.580000000000005,24.890000000000008,30.929999999999993,33.480000000000004,45.680000000000007,50.650000000000006,58.900000000000006]
[45,20.619999999999997,25.310000000000002,30.970000000000006,34.209999999999994,46.64,51.710000000000008,60.099999999999994]
[46,21.229999999999997,25.370000000000005,32.15,34.800000000000004,46.680000000000007,52.72999999999999,61.539999999999992]
[47,21.270000000000003,25.409999999999997,32.72,35.549999999999997,48.680000000000007,53.8,62.75]
[48,21.33,25.470000000000006,33.149999999999991,36.150000000000006,49.839999999999989,54.86,64.030000000000015]
[49,21.369999999999997,25.509999999999998,33.190000000000005,36.879999999999995,49.88000000000001,55.519999999999982,64.06]
[50,21.410000000000004,25.539999999999992,33.229999999999997,36.920000000000009,49.92,55.560000000000016,64.099999999999994]
[51,22.46,28.360000000000007,34.900000000000006,38.080000000000005,51.44,58.209999999999994,67.61]
[52,23.43,28.799999999999997,35.549999999999997,38.67,53.709999999999994,59.36999999999999,68.699999999999989]
[53,23.520000000000003,29.36,36.17,39.309999999999995,53.920000000000016,59.419999999999987,69.990000000000009]
[54,23.560000000000002,29.659999999999997,36.209999999999994,40.04,53.960000000000008,59.980000000000018,70.03]
[55,23.85,30.22,37.44,40.64,56.330000000000013,62.739999999999995,72.440000000000012]
[56,24.200000000000003,30.259999999999991,37.479999999999997,41.370000000000005,57.08,62.77000000000001,73.819999999999993]
[57,24.43,30.32,38.67,42,57.11,65.009999999999991,75.11]
[58,24.47,30.359999999999992,38.729999999999997,42.66,58.97999999999999,66.340000000000018,76.350000000000009]
[59,24.520000000000003,30.400000000000006,38.770000000000003,43.25,59.039999999999992,67.449999999999989,77.749999999999986]
[60,24.559999999999995,30.43,38.809999999999995,43.31,60.139999999999986,67.490000000000009,79.16]
[61,25.909999999999997,32.72,40.89,44.78,62.100000000000009,69.680000000000007,80.430000000000007]
[62,26.330000000000005,33.529999999999994,41.540000000000006,45.39,63.179999999999993,70.88,81.740000000000009]
[63,27.6,34.050000000000004,41.730000000000004,46.099999999999994,64.260000000000005,72.010000000000005,83.080000000000013]
[64,27.64,34.379999999999995,41.769999999999996,46.72,65.329999999999984,73.150000000000006,84.41]
[65,27.680000000000007,35.090000000000003,43.539999999999992,47.349999999999994,65.37,74.289999999999992,85.6]
[66,27.72,35.42,43.58,47.39,66.489999999999995,75.459999999999994,87.07]
[67,27.780000000000008,35.94,43.61999999999999,47.430000000000007,66.55,75.61,88.429999999999978]
[68,27.82,36.250000000000007,45.259999999999991,49.379999999999995,66.589999999999989,75.650000000000006,89.78]
[69,27.849999999999994,36.79,45.300000000000011,49.430000000000007,66.62,75.69,89.820000000000022]
[70,28.699999999999996,36.840000000000003,45.83,50.690000000000012,68.490000000000009,78.92,92.59]
[71,28.740000000000009,38.059999999999995,47.16,51.11,68.53,80.889999999999986,94.039999999999992]
[72,28.799999999999997,38.44,47.89,51.819999999999993,72.13,82,95.35]
[73,30.990000000000002,38.480000000000004,47.97,52.439999999999984,72.169999999999987,82.06,95.710000000000008]
[74,31.029999999999994,38.539999999999992,48.010000000000005,52.739999999999995,72.210000000000008,82.1,95.75]
[75,31.090000000000003,38.580000000000005,48.570000000000007,52.78,72.25,82.949999999999989,95.79000000000002]
[76,31.129999999999995,38.619999999999997,48.61,52.819999999999993,72.63000000000001,84.240000000000009,98.230000000000018]
[77,31.17,38.650000000000006,49.050000000000011,52.900000000000006,72.67,85.34,100.97]
[78,31.199999999999996,38.69,49.09,52.94,72.709999999999994,85.37,101.00000000000003]
[79,31.240000000000009,38.729999999999997,49.129999999999995,54.92,72.749999999999986,85.78,102.31]
[80,31.28,38.770000000000003,49.180000000000007,54.980000000000018,72.780000000000015,85.82,102.35000000000002]
[81,32.24,40.929999999999993,50.219999999999985,55.02000000000001,74.819999999999993,88.18,102.38999999999999]
[82,32.279999999999994,41.39,50.260000000000005,57.349999999999994,77.269999999999982,93.29000000000002,102.88999999999999]
[83,33.090000000000003,41.429999999999993,51.550000000000011,58,79.72999999999999,93.339999999999975,105.73999999999998]
[84,33.149999999999991,42.410000000000011,54.61,60.180000000000007,79.769999999999982,93.380000000000024,105.80000000000001]
[85,33.190000000000005,44.39,55.150000000000006,61.539999999999992,81.079999999999984,93.710000000000008,113.07]
[86,34.209999999999994,44.989999999999995,55.750000000000014,62.11999999999999,81.119999999999976,95.580000000000013,114.48000000000002]
[87,34.25,46.11999999999999,56.47999999999999,62.159999999999982,81.830000000000013,95.609999999999985,115.64999999999998]
[88,34.279999999999994,46.350000000000009,56.769999999999982,62.81,81.87,95.649999999999977,115.71000000000001]
[89,34.320000000000007,46.39,56.83,62.870000000000005,81.91,95.710000000000008,115.76999999999998]
[90,34.36,46.84,56.859999999999985,62.910000000000011,81.949999999999989,95.75,115.81]
[91,36.519999999999996,47.240000000000009,57.190000000000012,63.33,81.989999999999981,95.79000000000002,116.22999999999999]
[92,36.56,47.55,57.230000000000004,65.529999999999987,85.12,95.830000000000013,116.27000000000001]
[93,36.589999999999996,48.2,59.849999999999994,65.570000000000007,85.16,100.02000000000001,116.31000000000003]
[94,36.630000000000003,48.239999999999995,59.890000000000015,65.600000000000009,86.989999999999981,100.05999999999997,116.35]
[95,36.67,48.3,59.930000000000007,65.64,87.03,100.1,116.39000000000001]
[96,37.790000000000006,48.34,60.44,66.64,88.950000000000017,102.86999999999998,116.41999999999999]
[97,38.229999999999997,48.38000000000001,60.5,66.679999999999993,88.990000000000009,106.82,124.53]
[98,38.290000000000006,48.41,60.540000000000006,66.720000000000013,90.07,106.86000000000001,124.57000000000002]
[99,40.39,48.47,61.89,66.760000000000005,91.509999999999991,106.89999999999998,124.61999999999998]
[100,40.42,48.510000000000005,63.14,70.45,98.56,109.34,125.88999999999999]
[101,40.83,49,63.769999999999982,71.160000000000011,99.550000000000011,110.42999999999998,127.14999999999998]
[102,41.22999999999999,49.480000000000004,64.400000000000006,71.86,100.53,111.53,128.41000000000003]
[103,41.64,49.97,65.029999999999987,72.570000000000007,101.52000000000001,112.61999999999998,129.67000000000002]
[104,42.040000000000006,50.449999999999989,65.67,73.27,102.5,113.71000000000001,130.92999999999998]
[105,42.45,50.940000000000012,66.299999999999983,73.98,103.49000000000001,114.81,132.19000000000003]
[106,42.849999999999994,51.42,66.930000000000007,74.679999999999993,104.47000000000003,115.90000000000003,133.45000000000002]
[107,43.25,51.91,67.559999999999988,75.39,105.46000000000001,116.99000000000001,134.70999999999998]
[108,43.660000000000011,52.390000000000015,68.19,76.089999999999989,106.44000000000003,118.09000000000003,135.97000000000003]
[109,44.06,52.88000000000001,68.819999999999993,76.8,107.43,119.18,137.23000000000002]
[110,44.47,53.36,69.45,77.500000000000014,108.42000000000002,120.26999999999998,138.47999999999999]
[111,44.86999999999999,53.850000000000009,70.089999999999989,78.209999999999994,109.40000000000003,121.37,139.74000000000004]
[112,45.28,54.33,70.720000000000013,78.910000000000011,110.39000000000001,122.45999999999998,141]
[113,45.680000000000007,54.819999999999993,71.349999999999994,79.609999999999985,111.36999999999998,123.55000000000001,142.26]
[114,46.08,55.299999999999983,71.98,80.319999999999993,112.35999999999999,124.64999999999998,143.51999999999998]
[115,46.489999999999995,55.790000000000006,72.61,81.019999999999982,113.33999999999997,125.74000000000001,144.78]
[116,46.89,56.269999999999996,73.240000000000009,81.72999999999999,114.32999999999998,126.82999999999998,146.04]
[117,47.3,56.759999999999991,73.86999999999999,82.43,115.32,127.92999999999998,147.29999999999998]
[118,47.7,57.240000000000009,74.510000000000005,83.139999999999986,116.29999999999998,129.02000000000001,148.56]
[119,48.11,57.730000000000004,75.14,83.84,117.28999999999999,130.10999999999999,149.82]
[120,48.510000000000005,58.209999999999994,75.77000000000001,84.549999999999983,118.26999999999998,131.21,151.06999999999996]
[121,48.91,58.7,76.399999999999991,85.25,119.25999999999999,132.29999999999998,152.33000000000001]
[122,49.319999999999993,59.179999999999993,77.030000000000015,85.95999999999998,120.23999999999998,133.39000000000001,153.59]
[123,49.72,59.669999999999987,77.66,86.66,121.22999999999999,134.48999999999998,154.84999999999997]
[124,50.129999999999995,60.150000000000006,78.29000000000002,87.359999999999985,122.21000000000001,135.58000000000001,156.11000000000001]
[125,50.53,60.64,78.92,88.07,123.19999999999999,136.66999999999999,157.37]
[126,50.940000000000012,61.11999999999999,79.559999999999988,88.77000000000001,124.19,137.76999999999998,158.63]
[127,51.339999999999989,61.610000000000014,80.19,89.47999999999999,125.17000000000002,138.86000000000001,159.89000000000001]
[128,51.740000000000009,62.09,80.819999999999993,90.18,126.16,139.95999999999998,161.14999999999998]
[129,52.149999999999991,62.58,81.449999999999989,90.889999999999986,127.14000000000001,141.05000000000001,162.39999999999998]
[130,52.55,63.060000000000016,82.079999999999984,91.59,128.13000000000002,142.13999999999999,163.66000000000003]
[131,52.960000000000008,63.55,82.710000000000008,92.299999999999983,129.11000000000001,143.24,164.92000000000002]
[132,53.36,64.029999999999987,83.34,93,130.10000000000002,144.32999999999998,166.18]
[133,53.77000000000001,64.52000000000001,83.980000000000018,93.70999999999998,131.08000000000001,145.42000000000002,167.44]
[134,54.169999999999987,65,84.609999999999985,94.41,132.07000000000002,146.52000000000001,168.7]
[135,54.569999999999993,65.489999999999995,85.240000000000009,95.110000000000014,133.06000000000003,147.60999999999999,169.95999999999998]
[136,54.980000000000018,65.970000000000013,85.87,95.82,134.04000000000002,148.70000000000002,171.22000000000003]
[137,55.379999999999995,66.460000000000008,86.5,96.52000000000001,135.03000000000003,149.79999999999998,172.48000000000002]
[138,55.790000000000006,66.94,87.13,97.22999999999999,136.00999999999996,150.89000000000001,173.74]
[139,56.189999999999984,67.429999999999993,87.760000000000019,97.93,136.99999999999997,151.97999999999999,174.98999999999995]
[140,56.59,67.910000000000011,88.4,98.639999999999986,137.97999999999999,153.08000000000001,176.25]
[141,57.000000000000014,68.399999999999991,89.03,99.339999999999975,138.96999999999997,154.16999999999999,177.51]
[142,57.399999999999991,68.879999999999981,89.66,100.05000000000001,139.95999999999998,155.25999999999996,178.76999999999998]
[143,57.81,69.37,90.29000000000002,100.75,140.94,156.36000000000001,180.03000000000003]
[144,58.209999999999994,69.849999999999994,90.919999999999987,101.45999999999998,141.92999999999998,157.44999999999999,181.29000000000002]
[145,58.620000000000005,70.339999999999989,91.550000000000011,102.16000000000003,142.91,158.54000000000002,182.54999999999995]
[146,59.02000000000001,70.820000000000007,92.18,102.86000000000001,143.89999999999998,159.63999999999999,183.81]
[147,59.419999999999987,71.31,92.820000000000022,103.57,144.88,160.73000000000002,185.07]
[148,59.830000000000013,71.789999999999992,93.449999999999989,104.26999999999998,145.87,161.82,186.32]
[149,60.22999999999999,72.280000000000015,94.080000000000013,104.98000000000002,146.85,162.92000000000002,187.58000000000004]
[150,60.64,72.760000000000005,94.710000000000008,105.68,147.84,164.01,188.83999999999997]

{"sheet":"FX GND","index":17,"n_rows":156,"n_cols":8,"rows_kept":156,"cut":false,"hidden":true,"merged":[[0,6,0,7]]}
["2016 NASPO Comparison",null,null,null,null,null,"Ground"]
[]
[null,"Ground"]
[]
[]
["Lbs.",2,3,4,5,6,7,8]
[1,3.7,3.71,3.72,3.73,3.76,3.83,3.94]
[2,3.71,3.72,3.76,3.9,4.13,4.13,4.13]
[3,3.72,3.73,4.12,4.13,4.13,4.18,4.5]
[4,3.73,3.75,4.13,4.13,4.2699999999999996,4.4000000000000004,4.79]
[5,3.74,3.91,4.13,4.1900000000000004,4.47,4.6399999999999997,5.07]
[6,3.75,4.0599999999999996,4.13,4.1900000000000004,4.5199999999999996,4.67,5.0999999999999996]
[7,3.92,4.13,4.13,4.3099999999999996,4.6100000000000003,4.84,5.34]
[8,4.08,4.13,4.13,4.41,4.75,5.05,5.68]
[9,4.13,4.13,4.22,4.54,4.88,5.33,6.05]
[10,4.13,4.13,4.24,4.5599999999999996,5.07,5.72,6.45]
[11,4.13,4.13,4.26,4.58,5.13,5.93,6.72]
[12,4.13,4.13,4.3099999999999996,4.68,5.36,6.33,7.19]
[13,4.13,4.13,4.3899999999999997,4.79,5.63,6.74,7.69]
[14,4.13,4.24,4.49,4.91,5.93,7.14,8.17]
[15,4.13,4.37,4.5599999999999996,5.0199999999999996,6.25,7.52,8.67]
[16,4.2,4.4400000000000004,4.6399999999999997,5.1100000000000003,6.48,7.86,9.07]
[17,4.24,4.6100000000000003,4.7699999999999996,5.33,6.81,8.24,9.51]
[18,4.29,4.76,4.92,5.61,7.16,8.61,9.99]
[19,4.3899999999999997,4.91,5.1100000000000003,5.87,7.46,9,10.48]
[20,4.47,5.03,5.27,6.2,7.87,9.4600000000000009,11.09]
[21,4.49,5.1100000000000003,5.34,6.25,7.94,9.52,11.19]
[22,4.5999999999999996,5.28,5.54,6.48,8.27,9.89,11.68]
[23,4.7,5.42,5.71,6.73,8.57,10.26,12.16]
[24,4.8099999999999996,5.57,5.91,6.93,8.9,10.61,12.62]
[25,4.92,5.71,6.09,7.15,9.2100000000000009,10.99,13.11]
[26,5.05,5.85,6.27,7.38,9.5399999999999991,11.37,13.58]
[27,5.18,5.99,6.45,7.6,9.8699999999999992,11.71,14.05]
[28,5.29,6.13,6.66,7.84,10.19,12.09,14.54]
[29,5.39,6.27,6.84,8.0500000000000007,10.52,12.45,15.04]
[30,5.54,6.43,7.06,8.32,10.87,12.81,15.52]
[31,5.64,6.57,7.24,8.5299999999999994,11.17,13.18,15.96]
[32,5.69,6.71,7.44,8.76,11.49,13.54,16.46]
[33,5.79,6.84,7.62,9.02,11.79,13.9,16.93]
[34,5.92,7,7.81,9.24,12.13,14.26,17.39]
[35,6.01,7.17,8,9.4700000000000006,12.43,14.63,17.86]
[36,6.12,7.29,8.18,9.73,12.74,14.99,18.28]
[37,6.22,7.46,8.36,9.94,13.01,15.35,18.62]
[38,6.33,7.59,8.5500000000000007,10.19,13.31,15.72,18.98]
[39,6.41,7.74,8.74,10.42,13.61,16.079999999999998,19.34]
[40,6.5,7.92,8.94,10.65,13.92,16.43,19.68]
[41,6.63,8.0399999999999991,9.09,10.89,14.19,16.79,20.04]
[42,6.73,8.19,9.2899999999999991,11.11,14.47,17.170000000000002,20.37]
[43,6.8,8.34,9.4600000000000009,11.37,14.73,17.53,20.72]
[44,6.89,8.4600000000000009,9.6199999999999992,11.59,15.01,17.89,21.07]
[45,6.96,8.6199999999999992,9.8000000000000007,11.83,15.25,18.260000000000002,21.43]
[46,7.06,8.76,9.94,12.05,15.5,18.61,21.78]
[47,7.13,8.9,10.11,12.25,15.72,18.98,22.13]
[48,7.17,9.02,10.26,12.48,15.93,19.350000000000001,22.48]
[49,7.19,9.02,10.42,12.68,16.16,19.71,22.82]
[50,7.22,9.0399999999999991,10.43,12.72,16.350000000000001,20.07,23.17]
[51,7.24,9.07,10.44,12.75,16.45,20.13,23.26]
[52,7.25,9.08,10.47,12.81,16.55,20.18,23.38]
[53,7.32,9.17,10.58,12.97,16.579999999999998,20.29,23.43]
[54,7.4,9.2799999999999994,10.73,13.14,16.59,20.47,23.77]
[55,7.47,9.34,10.84,13.32,16.77,20.63,24.11]
[56,7.53,9.42,10.95,13.53,16.97,20.79,24.46]
[57,7.62,9.52,11.07,13.71,17.149999999999999,20.92,24.75]
[58,7.69,9.6199999999999992,11.19,13.87,17.34,21.05,24.99]
[59,7.78,9.74,11.34,14,17.52,21.18,25.18]
[60,7.84,9.83,11.46,14.1,17.66,21.31,25.32]
[61,7.92,9.92,11.58,14.26,17.809999999999999,21.42,25.5]
[62,7.97,10,11.68,14.38,17.940000000000001,21.54,25.65]
[63,8.0399999999999991,10.11,11.78,14.5,18.059999999999999,21.68,25.8]
[64,8.09,10.199999999999999,11.91,14.62,18.18,21.85,25.95]
[65,8.18,10.34,12.05,14.71,18.350000000000001,21.95,26.11]
[66,8.25,10.46,12.19,14.8,18.52,22.05,26.3]
[67,8.32,10.55,12.31,14.89,18.690000000000001,22.16,26.36]
[68,8.3800000000000008,10.66,12.4,14.95,18.78,22.28,26.41]
[69,8.44,10.77,12.42,14.99,18.87,22.41,26.48]
[70,8.51,10.88,12.45,15.02,18.98,22.53,26.56]
[71,8.6,10.9,12.46,15.04,19.05,22.67,26.64]
[72,9.02,11.2,12.55,15.16,19.11,22.69,26.67]
[73,9.4600000000000009,11.61,12.84,15.53,19.18,22.74,26.69]
[74,9.9,12.04,13.24,15.94,19.54,22.92,26.71]
[75,10.36,12.43,13.61,16.34,19.89,23.33,26.73]
[76,10.81,12.84,14.01,16.73,20.239999999999998,23.77,26.78]
[77,11.23,13.25,14.38,17.11,20.6,24.2,26.83]
[78,11.69,13.65,14.77,17.489999999999998,20.96,24.61,26.86]
[79,12.14,14.06,15.16,17.89,21.32,24.97,26.97]
[80,12.58,14.48,15.53,18.27,21.67,25.3,27.31]
[81,12.91,14.82,15.91,18.510000000000002,21.96,25.66,27.64]
[82,13.33,15.19,16.3,18.899999999999999,22.24,26.02,27.96]
[83,13.79,15.55,16.68,19.260000000000002,22.59,26.36,28.27]
[84,14.25,15.94,17.03,19.63,22.93,26.69,28.59]
[85,14.71,16.329999999999998,17.39,20,23.27,26.97,28.9]
[86,15.19,16.72,17.77,20.37,23.6,27.28,29.24]
[87,15.65,17.12,18.2,20.76,23.9,27.55,29.54]
[88,16.149999999999999,17.52,18.559999999999999,21.12,24.22,27.83,29.89]
[89,16.63,17.899999999999999,18.940000000000001,21.48,24.53,28.13,30.2]
[90,17.11,18.3,19.309999999999999,21.77,24.84,28.4,30.52]
[91,17.54,18.7,19.739999999999998,22.14,25.16,28.7,30.85]
[92,17.95,19.07,20.09,22.45,25.46,28.99,31.16]
[93,18.38,19.46,20.52,22.8,25.75,29.3,31.48]
[94,18.82,19.86,20.88,23.11,26.07,29.61,31.82]
[95,19.25,20.27,21.32,23.46,26.36,29.94,32.15]
[96,19.7,20.64,21.75,23.82,26.69,30.24,32.47]
[97,20.13,21.03,22.09,24.2,26.98,30.56,32.81]
[98,20.58,21.38,22.53,24.5,27.31,30.86,33.130000000000003]
[99,21.04,21.7,22.97,24.81,27.62,31.15,33.46]
[100,21.5,22.06,23.39,25.18,27.92,31.46,33.78]
[101,25.27,25.96,27.76,29.78,32.58,36.71,39.369999999999997]
[102,25.54,26.37,28.1,30.16,32.94,37.08,39.76]
[103,25.96,26.79,28.44,30.5,33.270000000000003,37.43,40.11]
[104,26.37,27.19,28.8,30.8,33.619999999999997,37.79,40.479999999999997]
[105,26.82,27.62,29.15,31.14,33.97,38.15,40.840000000000003]
[106,27.27,28.03,29.49,31.46,34.299999999999997,38.5,41.21]
[107,27.7,28.46,29.85,31.81,34.659999999999997,38.85,41.59]
[108,28.16,28.88,30.2,32.14,35,39.22,41.96]
[109,28.59,29.3,30.54,32.47,35.32,39.57,42.33]
[110,29.07,29.74,30.92,32.799999999999997,35.68,39.93,42.7]
[111,29.38,30.07,31.28,33.130000000000003,36.03,40.29,43.05]
[112,29.7,30.41,31.63,33.479999999999997,36.36,40.630000000000003,43.42]
[113,30,30.75,31.99,33.79,36.71,40.98,43.77]
[114,30.33,31.1,32.35,34.14,37.08,41.34,44.13]
[115,30.65,31.46,32.69,34.47,37.4,41.69,44.5]
[116,30.98,31.81,33.06,34.81,37.770000000000003,42.05,44.85]
[117,31.3,32.159999999999997,33.42,35.130000000000003,38.11,42.41,45.22]
[118,31.63,32.51,33.78,35.479999999999997,38.44,42.76,45.57]
[119,31.94,32.880000000000003,34.15,35.81,38.799999999999997,43.12,45.92]
[120,32.49,33.22,34.51,36.15,39.11,43.47,46.3]
[121,32.909999999999997,33.590000000000003,34.869999999999997,36.479999999999997,39.5,43.83,46.65]
[122,33.229999999999997,33.94,35.25,36.82,39.83,44.17,47.04]
[123,33.58,34.29,35.619999999999997,37.159999999999997,40.19,44.53,47.39]
[124,33.909999999999997,34.68,36,37.5,40.53,44.88,47.77]
[125,34.24,35.03,36.36,37.840000000000003,40.880000000000003,45.23,48.14]
[126,34.58,35.39,36.75,38.19,41.24,45.6,48.5]
[127,34.9,35.75,37.130000000000003,38.53,41.58,45.94,48.88]
[128,35.25,36.130000000000003,37.5,38.880000000000003,41.94,46.29,49.25]
[129,35.58,36.479999999999997,37.880000000000003,39.229999999999997,42.29,46.64,49.61]
[130,35.92,36.840000000000003,38.24,39.56,42.63,47.01,49.99]
[131,36.270000000000003,37.229999999999997,38.64,39.909999999999997,42.99,47.35,50.35]
[132,36.6,37.590000000000003,39.020000000000003,40.25,43.35,47.71,50.72]
[133,36.94,37.96,39.4,40.58,43.69,48.08,51.07]
[134,37.28,38.340000000000003,39.79,40.950000000000003,44.04,48.42,51.45]
[135,37.64,38.72,40.19,41.28,44.4,48.78,51.82]
[136,37.96,39.08,40.58,41.62,44.74,49.13,52.2]
[137,38.31,39.47,40.97,41.97,45.1,49.48,52.57]
[138,38.65,39.85,41.36,42.33,45.46,49.83,52.93]
[139,39,40.25,41.73,42.68,45.81,50.19,53.29]
[140,39.35,40.630000000000003,42.13,43.02,46.16,50.55,53.68]
[141,39.700000000000003,41,42.52,43.38,46.52,50.89,54.04]
[142,40.04,41.4,42.94,43.72,46.87,51.24,54.41]
[143,40.409999999999997,41.77,43.34,44.08,47.23,51.59,54.78]
[144,40.770000000000003,42.15,43.72,44.42,47.59,51.95,55.14]
[145,41.1,42.56,44.13,44.77,47.94,52.29,55.51]
[146,41.47,42.95,44.53,45.13,48.3,52.64,55.86]
[147,41.82,43.35,44.94,45.48,48.67,53,56.25]
[148,42.17,43.72,45.34,45.83,49.01,53.36,56.62]
[149,42.51,44.11,45.75,46.18,49.37,53.7,56.97]
[150,38.389714311627003,39.773034645383703,41.501544531108301,43.413884454924698,47.106140032650103,52.249827680029,55.624990023580601]

{"sheet":"FX PO","index":18,"n_rows":60,"n_cols":8,"rows_kept":60,"cut":false,"hidden":true,"merged":[]}
["2016 NASPO Comparison",null,null,null,null,null,"Priority Overnight"]
[]
[]
[]
[]
[null,"FedEx"]
[null,2,3,4,5,6,7,8]
[0.5,6.24,6.44,7.46,7.87,8.08,8.7100000000000009,9.01]
["PAK1",6.3,8.3699999999999992,10.5,11.65,12.63,13.49,13.87]
["PAK2",6.44,9.1,11.83,12.89,14.3,14.86,15.46]
[1,6.3,8.3699999999999992,10.5,11.65,12.63,13.49,13.87]
[2,6.44,9.1,11.83,12.89,14.3,14.86,15.46]
[3,7.26,9.67,13.09,14.28,15.85,16.34,16.920000000000002]
[4,7.81,10.119999999999999,14.2,15.63,17.3,17.78,18.48]
[5,7.91,10.54,15.52,17.09,18.760000000000002,19.28,19.96]
[6,8.67,11.14,16.79,18.440000000000001,20.32,20.64,21.52]
[7,9.07,11.7,17.95,19.8,21.75,22.21,22.98]
[8,9.25,12.26,19.12,21.07,23.2,23.78,24.47]
[9,9.36,12.73,20.190000000000001,22.43,24.66,25.31,26.02]
[10,9.3699999999999992,12.74,21.14,23.6,26.12,26.79,27.58]
[11,10.26,13.98,22.24,24.89,27.58,28.37,29.05]
[12,10.66,14.53,23.44,26.04,28.9,29.94,30.61]
[13,10.84,15.11,24.56,27.21,30.08,31.49,32.08]
[14,11.25,15.66,25.82,28.37,31.27,32.880000000000003,33.659999999999997]
[15,11.51,16.239999999999998,26.7,29.51,32.42,33.950000000000003,34.94]
[16,11.84,16.77,27.98,30.61,33.49,34.83,35.82]
[17,12.34,17.34,28.78,31.6,34.24,35.619999999999997,36.6]
[18,12.76,17.91,29.63,32.25,35.020000000000003,36.4,37.56]
[19,13.05,18.38,30.34,32.93,35.81,37.200000000000003,38.56]
[20,13.13,18.78,31.1,33.74,36.57,38.090000000000003,39.43]
[21,13.69,19.350000000000001,31.79,34.590000000000003,37.340000000000003,38.840000000000003,40.49]
[22,14.12,19.78,32.54,35.380000000000003,38.130000000000003,39.74,41.39]
[23,14.4,20.170000000000002,33.32,36.26,38.99,40.6,42.36]
[24,14.72,20.53,34.200000000000003,37.17,40.03,41.49,43.23]
[25,14.98,20.83,35.08,37.92,41.12,42.48,44.11]
[26,15.4,21.45,36.06,38.869999999999997,42.18,43.56,45.05]
[27,15.71,21.86,36.93,39.979999999999997,43.36,44.51,45.89]
[28,16.09,22.33,37.909999999999997,41.12,44.22,45.39,46.87]
[29,16.38,22.7,38.89,41.99,45.17,46.41,47.87]
[30,16.420000000000002,22.88,39.64,42.96,46.07,47.27,48.19]
[31,16.989999999999998,23.53,40.49,43.93,47.02,48.26,49.82]
[32,17.489999999999998,24.1,41.39,44.92,47.97,49.21,50.76]
[33,17.89,24.67,42.18,45.86,48.94,50.32,51.93]
[34,18.28,25.09,43.15,46.84,50.01,51.4,52.99]
[35,18.850000000000001,25.55,44.11,47.82,50.97,52.48,54.04]
[36,19.29,25.93,45.07,48.79,51.97,53.63,55.09]
[37,19.329999999999998,26.69,45.96,49.79,53.01,54.83,56.26]
[38,19.62,27.11,46.76,50.64,54.01,56.1,57.34]
[39,20.260000000000002,27.58,47.64,51.6,55.06,57.26,58.46]
[40,20.43,28.04,48.49,52.58,56.03,58.34,59.63]
[41,20.91,28.61,49.37,53.59,57.09,59.3,60.77]
[42,21.23,29.19,50.34,54.52,58.23,60.7,62.01]
[43,21.8,29.74,51.33,55.49,59.31,61.66,63.26]
[44,22.28,30.33,52.2,56.48,60.37,62.74,64.62]
[45,22.75,30.98,53.12,57.44,61.57,63.84,65.67]
[46,23.2,31.64,54.05,58.45,62.7,64.930000000000007,66.81]
[47,23.59,32.29,55.02,59.28,63.88,65.86,67.86]
[48,23.76,32.93,55.8,60.27,65.02,67.069999999999993,69.150000000000006]
[49,24.18,33.69,56.56,61.21,66.14,68.14,70.36]
[50,24.19,34.049999999999997,56.58,61.22,66.16,68.98,70.39]

{"sheet":"FX STD","index":19,"n_rows":59,"n_cols":8,"rows_kept":59,"cut":false,"hidden":true,"merged":[]}
["2016 NASPO Comparison",null,null,null,null,null,"Standard Overnight"]
[]
[null,"FedEx Standard Overnight"]
[]
[null,"FedEx  "]
[null,2,3,4,5,6,7,8]
[0.5,5.85,5.96,6.95,7.33,7.38,7.85,8.24]
["PAK1",5.96,6.93,9.2200000000000006,10.220000000000001,11.09,11.84,12.17]
["PAK2",6.01,7.34,10.39,11.3,12.52,13.05,13.57]
[1,5.96,6.93,9.2200000000000006,10.220000000000001,11.09,11.84,12.17]
[2,6.01,7.34,10.39,11.3,12.52,13.05,13.57]
[3,6.01,7.79,11.51,12.52,13.92,14.32,14.83]
[4,6.38,8.3000000000000007,12.48,13.7,15.18,15.61,16.23]
[5,6.55,8.4,13.64,14.9,16.190000000000001,16.63,17.22]
[6,6.93,9.44,14.75,15.91,17.54,17.8,18.559999999999999]
[7,7.06,9.86,15.81,17.29,18.77,19.170000000000002,19.82]
[8,7.43,10.15,16.8,18.399999999999999,20.04,20.52,21.08]
[9,7.83,10.59,17.75,19.579999999999998,21.29,21.87,22.46]
[10,7.98,11.01,18.559999999999999,20.62,22.55,23.13,23.79]
[11,8.27,11.5,19.55,21.73,23.79,24.49,25.08]
[12,8.5299999999999994,12.06,20.62,22.74,24.96,25.83,26.41]
[13,8.67,12.68,21.58,23.78,25.95,27.17,27.7]
[14,8.9700000000000006,13.14,22.7,24.8,26.96,28.36,29.05]
[15,9.33,13.61,23.47,25.8,27.98,29.29,30.15]
[16,9.51,13.95,24.6,26.74,28.89,30.06,30.93]
[17,10,14.19,25.29,27.6,29.55,30.73,31.6]
[18,10.31,14.57,26.07,28.17,30.22,31.41,32.43]
[19,10.56,14.95,26.68,28.76,30.9,32.090000000000003,33.26]
[20,10.74,15.39,28.76,31.26,33.450000000000003,34.840000000000003,36.11]
[21,11.04,15.71,29.53,32.01,34.42,35.840000000000003,37.119999999999997]
[22,11.44,16.03,30.27,32.76,35.299999999999997,36.64,37.89]
[23,11.61,16.32,31.1,33.56,36.11,37.340000000000003,38.799999999999997]
[24,11.92,16.600000000000001,31.94,34.42,37.1,38.26,39.6]
[25,12.19,16.97,32.89,35.520000000000003,38.049999999999997,39.39,40.53]
[26,12.48,17.420000000000002,33.82,36.36,38.94,40.21,41.44]
[27,12.67,17.91,34.729999999999997,37.17,39.68,41.49,42.49]
[28,13.06,18.38,35.520000000000003,37.92,40.659999999999997,42.17,43.71]
[29,13.33,18.46,36.299999999999997,38.69,41.44,42.97,44.82]
[30,13.54,18.940000000000001,37.299999999999997,39.57,42.42,44.13,45.51]
[31,13.81,19.14,38.049999999999997,40.53,43.36,44.91,46.3]
[32,14.1,19.260000000000002,38.69,41.44,44.33,45.75,47.22]
[33,14.4,19.86,39.47,42.29,45.45,46.62,48.27]
[34,14.65,20.329999999999998,40.44,43.04,46.45,47.6,49.2]
[35,15.08,20.7,41.29,43.91,47.31,48.61,50.23]
[36,15.35,21.15,42.15,44.78,48.28,49.6,51.37]
[37,15.64,21.43,43.28,45.88,49.26,50.45,52.33]
[38,15.91,21.87,44.24,46.96,50.26,51.19,53.2]
[39,16.309999999999999,22.39,45.22,47.96,51.46,52.08,54.18]
[40,16.579999999999998,22.89,46.15,49.05,52.58,53.2,55.37]
[41,16.87,23.2,46.86,50.02,53.64,54.18,56.57]
[42,17.149999999999999,23.52,47.65,51.14,54.71,55.24,57.9]
[43,17.420000000000002,24.07,48.49,52.2,55.69,56.37,59.17]
[44,17.739999999999998,24.47,49.4,53.2,56.93,57.32,60.38]
[45,18.02,24.99,50.26,54.18,57.97,58.4,61.2]
[46,18.3,25.41,51.19,55.07,58.97,59.52,62.35]
[47,18.690000000000001,25.93,52.2,55.91,59.86,60.73,63.39]
[48,18.98,26.46,53.2,56.93,60.81,61.68,64.19]
[49,19.260000000000002,26.97,53.92,57.58,61.73,62.69,65.03]
[50,19.63,27.39,53.99,57.59,61.74,62.7,65.05]

{"sheet":"Fx2DA AM","index":20,"n_rows":192,"n_cols":13,"rows_kept":192,"cut":false,"hidden":true,"merged":[[13,0,13,1],[0,0,1,1],[2,0,2,1],[3,0,3,1],[4,0,5,0],[6,0,6,1],[7,0,7,1],[8,0,8,1],[9,0,9,1],[10,0,10,1],[11,0,11,1],[12,0,12,1],[25,0,26,2],[27,0,27,2],[183,0,183,1],[14,0,14,1],[15,0,15,1],[16,0,16,1],[19,0,20,1],[22,0,23,1],[22,2,23,2]]}
["Express Rates"]
[]
["Created On: 03/27/2017 10:52 AM CT"]
[]
["Customer Name: CAMPUS POST OFFICE ETC.","Account Number:"]
[null,156124192]
[]
["Note: The net rate sheets presented in this document are based on customer's discounts effective on 03/27/2017. The net rate sheets presented in this document are for your convenience only and are not intended to be a agreement or part of a agreement. Actual net rates may vary due to changes in customer's shipping pattern that affects the revenue thresholds used in the rate calculations. The customer may have additional pricing features on the agreement that is not captured in the net rates calculations presented in this document. Please review your agreement for complete details or contact your Account Executive for more information."]
[]
["Net rates may include applicable Earned Discounts, Ground Threshold Discounts and Bonus Discounts."]
[]
["Any manual rating is not included in this rate sheet document."]
[]
["The net rates provided are calculated based on all applicable discounts and do not include surcharges and other handling fees."]
[]
["All rates are in US Dollar unless otherwise indicated."]
[]
[]
[]
["Express Domestic Rates"]
[]
[]
["Domestic Non-Freight",null,"Top"]
[]
[]
["Domestic 2 Day AM (Based on Custom rates [Envelope] [Pak] [Package] ) "]
[]
[]
["Weight (in Lbs)",2,3,4,5,6,7,8,9,13,14,15,16]
[0.5,5.71,5.71,5.71,5.71,6.54,6.81,6.85,9.14,9.51,9.51,9.51,9.51]
["FedEx 1 Lb Pak",5.71,5.71,5.71,5.71,6.61,6.9,6.98,13.24,13.19,13.19,13.19,13.19]
["FedEx 2 Lbs Pak",5.71,5.71,5.71,5.71,7.3,7.95,8.3000000000000007,14.74,14.32,14.32,14.32,14.32]
[1,5.71,5.71,5.71,5.71,6.61,6.9,6.98,13.24,13.19,13.19,13.19,13.19]
[2,5.71,5.71,5.71,5.71,7.3,7.95,8.3000000000000007,14.74,14.32,14.32,14.32,14.32]
[3,5.71,5.71,5.71,6.21,8.3800000000000008,9.2100000000000009,9.5,16.12,18.260000000000002,18.260000000000002,18.260000000000002,18.260000000000002]
[4,5.71,5.71,5.71,7.24,9.68,10.5,10.83,17.61,19.78,19.78,19.78,19.78]
[5,5.71,5.71,6,8,10.79,11.64,12.29,19.329999999999998,21.13,21.13,21.13,21.13]
[6,5.71,5.71,6.54,8.74,11.99,12.97,13.49,20.78,22.66,22.66,22.66,22.66]
[7,5.71,5.82,7.09,9.57,13.49,14.38,14.83,22.05,24.12,24.12,24.12,24.12]
[8,5.71,6.34,7.57,10.4,14.91,15.85,16.309999999999999,23.21,25.25,25.25,25.25,25.25]
[9,5.71,6.63,8.16,11.17,16.23,17.34,17.93,24.82,26.81,26.81,26.81,26.81]
[10,5.98,7.04,8.7799999999999994,11.92,17.3,18.87,19.39,26.21,28.26,28.26,28.26,28.26]
[11,6.25,7.4,9.2100000000000009,12.75,18.7,20.27,20.98,27.81,29.49,29.49,29.49,29.49]
[12,6.61,7.84,9.6999999999999993,13.47,20.12,21.69,22.42,28.95,30.12,30.12,30.12,30.12]
[13,7.04,8.25,10.06,14.29,21.44,22.73,23.72,30.35,30.93,30.93,30.93,30.93]
[14,7.35,8.65,10.69,15.12,22.73,23.95,24.77,31.82,31.76,31.76,31.76,31.76]
[15,7.64,8.9,11.22,15.69,23.95,24.99,25.92,33.01,32.68,32.68,32.68,32.68]
[16,7.84,9.17,11.71,16.2,24.99,26.29,26.98,33.840000000000003,33.93,33.93,33.93,33.93]
[17,8.08,9.4499999999999993,12.21,16.96,26.12,27.66,28.26,34.6,34.85,34.85,34.85,34.85]
[18,8.36,9.77,12.68,17.57,27.2,28.91,29.95,35.44,36.21,36.21,36.21,36.21]
[19,8.65,10.039999999999999,13.06,18.28,28.2,30.26,30.94,36.6,37.119999999999997,37.119999999999997,37.119999999999997,37.119999999999997]
[20,8.99,10.48,13.56,19.11,29.2,31.28,32.03,37.340000000000003,39.479999999999997,39.479999999999997,39.479999999999997,39.479999999999997]
[21,9.41,10.89,14.05,19.75,30.26,32.33,33.53,38.200000000000003,40.53,40.53,40.53,40.53]
[22,9.68,11.4,14.45,20.309999999999999,31.22,33.549999999999997,34.76,39.049999999999997,41.45,41.45,41.45,41.45]
[23,9.93,11.64,14.95,20.89,32.33,34.65,36.07,40.119999999999997,42.09,42.09,42.09,42.09]
[24,10.15,12.11,15.41,21.67,33.51,36,37.340000000000003,40.869999999999997,42.89,42.89,42.89,42.89]
[25,10.48,12.46,15.74,22.46,34.61,37.29,38.64,42.13,43.72,43.72,43.72,43.72]
[26,10.79,12.77,16.309999999999999,23.17,35.770000000000003,38.549999999999997,39.68,42.78,44.45,44.45,44.45,44.45]
[27,11.15,13.17,16.73,24,36.979999999999997,39.85,40.93,43.99,45.18,45.18,45.18,45.18]
[28,11.48,13.62,17.079999999999998,24.58,37.92,40.869999999999997,41.93,44.72,46.1,46.1,46.1,46.1]
[29,11.8,13.83,17.63,25.15,38.96,41.93,43.17,45.71,47.12,47.12,47.12,47.12]
[30,12.02,14.22,18.25,25.93,40,43.03,44.26,46.8,47.95,47.95,47.95,47.95]
[31,12.37,14.68,18.739999999999998,26.56,40.93,43.99,45.41,47.76,48.78,48.78,48.78,48.78]
[32,12.56,15.02,19.28,27.18,42.1,45.17,46.54,48.85,49.81,49.81,49.81,49.81]
[33,12.91,15.37,19.77,27.74,43.24,46.24,47.68,49.94,50.85,50.85,50.85,50.85]
[34,13.31,15.69,20.190000000000001,28.74,44.57,47.33,48.89,51.11,51.79,51.79,51.79,51.79]
[35,13.6,16.16,20.64,29.3,46.85,48.22,50.06,52.1,52.8,52.8,52.8,52.8]
[36,13.77,16.52,21.02,29.91,47.8,49.1,51.14,53.17,53.94,53.94,53.94,53.94]
[37,14.03,16.75,21.56,30.66,48.78,49.97,51.81,54.16,54.75,54.75,54.75,54.75]
[38,14.29,17.010000000000002,22.1,31.3,49.75,50.69,52.66,55.46,55.78,55.78,55.78,55.78]
[39,14.72,17.45,22.48,31.89,50.94,51.57,53.66,56.55,56.94,56.94,56.94,56.94]
[40,15.12,17.91,23.01,32.630000000000003,52.04,52.66,54.82,57.73,57.98,57.98,57.98,57.98]
[41,15.51,18.32,23.28,33.229999999999997,53.09,53.66,56.01,58.92,59.21,59.21,59.21,59.21]
[42,15.74,18.8,23.76,33.909999999999997,54.16,54.7,57.32,60.12,60.13,60.13,60.13,60.13]
[43,16.09,19.18,24.1,34.479999999999997,55.14,55.81,58.58,61.33,61.06,61.06,61.06,61.06]
[44,16.36,19.43,24.63,35.1,56.36,56.75,59.89,62.16,62.19,62.19,62.19,62.19]
[45,16.73,19.87,24.99,35.6,57.4,57.83,60.97,63.16,63.32,63.32,63.32,63.32]
[46,16.940000000000001,20.12,25.52,36.15,58.38,58.93,61.96,64.33,64.150000000000006,64.150000000000006,64.150000000000006,64.150000000000006]
[47,17.3,20.51,25.95,36.65,59.26,60.13,62.9,65.209999999999994,65.180000000000007,65.180000000000007,65.180000000000007,65.180000000000007]
[48,17.63,20.98,26.41,37.19,60.2,61.06,63.77,66.400000000000006,65.989999999999995,65.989999999999995,65.989999999999995,65.989999999999995]
[49,17.97,21.48,26.88,37.840000000000003,61.1,62.06,64.39,67.38,67.459999999999994,67.459999999999994,67.459999999999994,67.459999999999994]
[50,18.260000000000002,21.76,27.31,38.47,61.14,62.07,64.41,68.38,68.48,68.48,68.48,68.48]
[51,18.5,21.99,27.74,39.020000000000003,62.9,64.3,66.92,69.55,69.63,69.63,69.63,69.63]
[52,18.739999999999998,22.36,28.26,39.96,63.77,65.63,68.19,70.760000000000005,70.849999999999994,70.849999999999994,70.849999999999994,70.849999999999994]
[53,19.07,22.77,28.65,40.56,64.510000000000005,67.040000000000006,69.62,71.92,71.989999999999995,71.989999999999995,71.989999999999995,71.989999999999995]
[54,19.350000000000001,23.15,29.07,41.16,65.41,68.510000000000005,70.900000000000006,73.430000000000007,73.12,73.12,73.12,73.12]
[55,19.73,23.53,29.43,41.93,66.37,69.48,72.14,74.53,74.05,74.05,74.05,74.05]
[56,20.02,23.86,29.87,42.6,67.34,70.959999999999994,73.39,76.03,75.39,75.39,75.39,75.39]
[57,20.27,24.25,30.35,43.21,68.62,72.239999999999995,74.38,77.23,76.53,76.53,76.53,76.53]
[58,20.64,24.63,30.92,43.92,70.06,73.599999999999994,75.73,78.61,77.98,77.98,77.98,77.98]
[59,20.89,24.92,31.48,44.7,71.44,74.760000000000005,77.03,79.94,79.099999999999994,79.099999999999994,79.099999999999994,79.099999999999994]
[60,21.08,25.17,31.99,45.33,72.64,76.14,78.260000000000005,81.44,80.45,80.45,80.45,80.45]
[61,21.48,25.52,32.4,45.9,73.92,77.44,79.62,82.88,81.91,81.91,81.91,81.91]
[62,21.88,25.97,32.79,46.64,75.239999999999995,78.599999999999994,81.099999999999994,84.51,83.32,83.32,83.32,83.32]
[63,22.23,26.41,33.19,47.29,76.53,79.739999999999995,82.56,86.12,84.77,84.77,84.77,84.77]
[64,22.63,26.83,33.590000000000003,47.92,77.84,81.239999999999995,84,87.53,86.13,86.13,86.13,86.13]
[65,22.96,27.21,34.1,48.64,79,82.51,85.23,88.94,85.57,85.57,85.57,85.57]
[66,23.26,27.45,34.590000000000003,49.42,80.3,84,86.33,90.55,88.69,88.69,88.69,88.69]
[67,23.45,28,35.1,50.23,81.48,85.23,87.64,91.86,90.14,90.14,90.14,90.14]
[68,23.74,28.26,35.6,51.08,82.77,86.46,89.06,93.28,91.59,91.59,91.59,91.59]
[69,24.12,28.65,36.090000000000003,52.02,84.19,87.64,90.42,94.58,93.04,93.04,93.04,93.04]
[70,24.5,29.09,36.65,52.93,85.61,88.81,91.95,95.98,94.37,94.37,94.37,94.37]
[71,24.82,29.49,37.130000000000003,53.65,86.1,89.7,93.25,97.29,95.71,95.71,95.71,95.71]
[72,25.13,30.01,37.61,54.47,87.34,91.2,94.87,99.03,97.28,97.28,97.28,97.28]
[73,25.34,30.31,38.14,55.37,88.51,92.62,96.6,100.74,98.39,98.39,98.39,98.39]
[74,25.7,30.64,38.659999999999997,56.1,89.9,93.86,98.34,102.39,99.74,99.74,99.74,99.74]
[75,26.07,31.13,39.1,56.87,91.12,95.43,99.34,103.88,101.39,101.39,101.39,101.39]
[76,26.33,31.5,39.590000000000003,57.52,92.38,96.83,101.14,105.52,102.71,102.71,102.71,102.71]
[77,26.81,31.93,40.049999999999997,58.26,93.56,98.34,102.88,107.01,104.08,104.08,104.08,104.08]
[78,27.05,32.159999999999997,40.64,59.12,94.74,99.62,104.7,108.44,105.41,105.41,105.41,105.41]
[79,27.37,32.56,41.18,59.94,95.98,101.01,106.26,109.97,106.94,106.94,106.94,106.94]
[80,27.81,32.97,41.78,60.7,97.03,102.52,107.21,111.46,108.41,108.41,108.41,108.41]
[81,28.04,33.32,42.25,60.84,98.02,103.85,108.91,112.99,109.73,109.73,109.73,109.73]
[82,28.35,33.74,42.7,62.3,99.29,105.33,110.28,114.41,112.03,112.03,112.03,112.03]
[83,28.56,34.14,43.27,62.81,100.57,106.83,111.73,116.05,113.25,113.25,113.25,113.25]
[84,28.93,34.590000000000003,43.64,63.38,101.76,108.37,112.98,117.65,114.4,114.4,114.4,114.4]
[85,29.28,35.04,44.09,64.39,102.98,109.77,114.36,118.46,115.92,115.92,115.92,115.92]
[86,29.66,35.1,44.61,65.14,104.24,111.15,115.72,120.58,117.07,117.07,117.07,117.07]
[87,29.91,35.75,45.1,65.88,105.46,112.7,116.97,121.98,118.5,118.5,118.5,118.5]
[88,30.14,36.18,45.67,66.489999999999995,106.64,113.95,118.32,123.15,119.97,119.97,119.97,119.97]
[89,30.49,36.43,46.09,67.12,107.93,115.22,119.78,124.36,121.19,121.19,121.19,121.19]
[90,31,36.799999999999997,46.54,67.81,109.13,116.49,121.06,125.66,122.74,122.74,122.74,122.74]
[91,31.44,37.270000000000003,46.64,68.680000000000007,110.31,117.86,122.4,127.28,125,125,125,125]
[92,31.83,37.64,47.5,69.39,111.65,119.12,123.77,128.01,126.45,126.45,126.45,126.45]
[93,32.07,38.18,48.02,69.989999999999995,112.89,120.35,125.16,130.22999999999999,127.91,127.91,127.91,127.91]
[94,32.36,38.24,48.11,70.599999999999994,114.09,121.75,126.44,131.96,129.47,129.47,129.47,129.47]
[95,32.630000000000003,38.31,49.02,71.37,115.42,122.94,127.85,133.24,130.78,130.78,130.78,130.78]
[96,32.880000000000003,38.96,49.47,72,116.69,124.3,129.13,134.66999999999999,132.13,132.13,132.13,132.13]
[97,33.19,39,49.92,72.56,117.87,125.61,130.47999999999999,135.96,133.35,133.35,133.35,133.35]
[98,33.51,39.06,50.26,72.62,119.19,126.89,131.86000000000001,137.35,134.61000000000001,134.61000000000001,134.61000000000001,134.61000000000001]
[99,33.78,39.1,50.41,72.650000000000006,120,128.25,133.22999999999999,138.54,136.06,136.06,136.06,136.06]
[100,34.22,39.4,50.69,73,120,128.97999999999999,133.74,138.80000000000001,136.88999999999999,136.88999999999999,136.88999999999999,136.88999999999999]
[101,34.56,39.799999999999997,51.19,73.73,121.2,130.26,135.07,140.19,138.27000000000001,138.27000000000001,138.27000000000001,138.27000000000001]
[102,34.9,40.21,51.68,74.459999999999994,122.4,131.55000000000001,136.41,141.57,139.63999999999999,139.63999999999999,139.63999999999999,139.63999999999999]
[103,35.25,40.6,52.2,75.19,123.6,132.83000000000001,137.75,142.96,141,141,141,141]
[104,35.590000000000003,41,52.7,75.92,124.8,134.12,139.09,144.35,142.38,142.38,142.38,142.38]
[105,35.93,41.39,53.22,76.650000000000006,126,135.41,140.4,145.72999999999999,143.74,143.74,143.74,143.74]
[106,36.270000000000003,41.78,53.72,77.38,127.2,136.69999999999999,141.76,147.12,145.11000000000001,145.11000000000001,145.11000000000001,145.11000000000001]
[107,36.619999999999997,42.17,54.22,78.11,128.4,137.99,143.09,148.52000000000001,146.47999999999999,146.47999999999999,146.47999999999999,146.47999999999999]
[108,36.94,42.58,54.73,78.84,129.6,139.28,144.43,149.9,147.85,147.85,147.85,147.85]
[109,37.29,42.96,55.23,79.569999999999993,130.80000000000001,140.59,145.77000000000001,151.28,149.22,149.22,149.22,149.22]
[110,37.64,43.36,55.75,80.3,132,141.87,147.1,152.66999999999999,150.58000000000001,150.58000000000001,150.58000000000001,150.58000000000001]
[111,37.97,43.74,56.25,81.03,133.19999999999999,143.16999999999999,148.46,154.06,151.96,151.96,151.96,151.96]
[112,38.32,44.14,56.76,81.760000000000005,134.4,144.44,149.78,155.44999999999999,153.33000000000001,153.33000000000001,153.33000000000001,153.33000000000001]
[113,38.659999999999997,44.55,57.27,82.49,135.6,145.72999999999999,151.13,156.84,154.69,154.69,154.69,154.69]
[114,39,44.93,57.77,83.22,136.80000000000001,147.03,152.46,158.22999999999999,156.07,156.07,156.07,156.07]
[115,39.35,45.33,58.28,83.95,138,148.30000000000001,153.78,159.62,157.44,157.44,157.44,157.44]
[116,39.700000000000003,45.73,58.79,84.68,139.19999999999999,149.6,155.12,161,158.79,158.79,158.79,158.79]
[117,40.03,46.12,59.29,85.41,140.4,150.88999999999999,156.47,162.38,160.16999999999999,160.16999999999999,160.16999999999999,160.16999999999999]
[118,40.380000000000003,46.52,59.81,86.14,141.6,152.19,157.81,163.79,161.54,161.54,161.54,161.54]
[119,40.729999999999997,46.9,60.31,86.87,142.80000000000001,153.47,159.13999999999999,165.17,162.9,162.9,162.9,162.9]
[120,41.06,47.29,60.82,87.6,144,154.76,160.49,166.56,164.27,164.27,164.27,164.27]
[121,41.41,47.69,61.32,88.33,145.19999999999999,156.06,161.82,167.95,165.65,165.65,165.65,165.65]
[122,41.74,48.1,61.83,89.06,146.4,157.35,163.16,169.33,167.01,167.01,167.01,167.01]
[123,42.09,48.47,62.34,89.79,147.6,158.63999999999999,164.5,170.72,168.38,168.38,168.38,168.38]
[124,42.43,48.88,62.85,90.52,148.80000000000001,159.91,165.84,172.11,169.76,169.76,169.76,169.76]
[125,42.77,49.28,63.36,91.25,150,161.21,167.16,173.5,171.13,171.13,171.13,171.13]
[126,43.11,49.67,63.86,91.98,151.19999999999999,162.51,168.5,174.89,172.49,172.49,172.49,172.49]
[127,43.45,50.06,64.36,92.71,152.4,163.80000000000001,169.84,176.28,173.86,173.86,173.86,173.86]
[128,43.79,50.44,64.87,93.44,153.6,165.08,171.19,177.66,175.23,175.23,175.23,175.23]
[129,44.13,50.85,65.37,94.17,154.80000000000001,166.37,172.51,179.05,176.59,176.59,176.59,176.59]
[130,44.49,51.25,65.88,94.9,156,167.66,173.86,180.44,177.97,177.97,177.97,177.97]
[131,44.82,51.63,66.38,95.63,157.19999999999999,168.95,175.2,181.82,179.34,179.34,179.34,179.34]
[132,45.17,52.03,66.88,96.36,158.4,170.23,176.52,183.21,180.7,180.7,180.7,180.7]
[133,45.51,52.42,67.400000000000006,97.09,159.6,171.53,177.88,184.6,182.07,182.07,182.07,182.07]
[134,45.85,52.81,67.900000000000006,97.82,160.80000000000001,172.82,179.2,185.99,183.45,183.45,183.45,183.45]
[135,46.19,53.22,68.42,98.55,162,174.12,180.55,187.37,184.81,184.81,184.81,184.81]
[136,46.54,53.62,68.92,99.28,163.19999999999999,175.4,181.87,188.75,186.18,186.18,186.18,186.18]
[137,46.88,54,69.42,100.01,164.4,176.69,183.21,190.15,187.56,187.56,187.56,187.56]
[138,47.22,54.4,69.930000000000007,100.74,165.6,177.98,184.56,191.54,188.91,188.91,188.91,188.91]
[139,47.57,54.79,70.44,101.47,166.8,179.27,185.89,192.92,190.28,190.28,190.28,190.28]
[140,47.9,55.18,70.95,102.2,168,180.56,187.23,194.33,191.66,191.66,191.66,191.66]
[141,48.25,55.58,71.459999999999994,102.93,169.2,181.84,188.57,195.72,193.02,193.02,193.02,193.02]
[142,48.59,55.97,71.97,103.66,170.4,183.14,189.9,197.09,194.39,194.39,194.39,194.39]
[143,48.93,56.36,72.47,104.39,171.6,184.42,191.24,198.48,195.76,195.76,195.76,195.76]
[144,49.28,56.76,72.97,105.12,172.8,185.71,192.58,199.88,197.14,197.14,197.14,197.14]
[145,49.61,57.15,73.489999999999995,105.85,174,187,193.92,201.26,198.5,198.5,198.5,198.5]
[146,49.97,57.55,73.989999999999995,106.58,175.2,188.29,195.25,202.65,199.87,199.87,199.87,199.87]
[147,50.3,57.94,74.510000000000005,107.31,176.4,189.6,196.58,204.03,201.25,201.25,201.25,201.25]
[148,50.64,58.33,75.010000000000005,108.04,177.6,190.87,197.93,205.43,202.61,202.61,202.61,202.61]
[149,50.98,58.74,75.5,108.77,178.8,192.17,199.26,206.81,203.97,203.97,203.97,203.97]
[150,51.33,59.14,76.02,109.5,180,193.45,200.61,208.19,205.35,205.35,205.35,205.35]
[]
["Per-pound rates. Multiply by actual shipment weight to get the final rate."]
[]
["Weight (in Lbs)","Zone -02","Zone -03","Zone -04","Zone -05","Zone -06","Zone -07","Zone -08","Zone -09","Zone -13","Zone -14","Zone -15","Zone -16"]
["100 - 150",0.36,0.4,0.51,0.73,1.2,1.29,1.34,1.39,1.37,1.37,1.37,1.37]
["151 - 299",0.36,0.4,0.51,0.73,1.2,1.29,1.34,1.39,1.37,1.37,1.37,1.37]
["300 - 499",0.36,0.4,0.51,0.73,1.2,1.29,1.34,1.39,1.37,1.37,1.37,1.37]
["500 - 999",0.36,0.4,0.51,0.73,1.2,1.29,1.34,1.39,1.37,1.37,1.37,1.37]
["1000 - 1999",0.36,0.4,0.51,0.73,1.2,1.29,1.34,1.39,1.37,1.37,1.37,1.37]
["2000 - 9999",0.36,0.4,0.51,0.73,1.2,1.29,1.34,1.39,1.37,1.37,1.37,1.37]

{"sheet":"Fx2DAY Air","index":21,"n_rows":59,"n_cols":8,"rows_kept":59,"cut":false,"hidden":true,"merged":[]}
["2016 NASPO Comparison",null,null,null,null,null,"2Day Air"]
[]
[null,"FedEx 2Day Express"]
[]
[null,"FedEx  "]
[null,2,3,4,5,6,7,8]
[0.5,5.13,5.13,5.13,5.25,6.19,6.48,6.53]
["PAK1",5.13,5.13,5.13,5.25,6.19,6.55,6.66]
["PAK2",5.13,5.13,5.13,5.43,6.94,7.56,7.9]
[1,5.13,5.13,5.13,5.25,6.19,6.55,6.66]
[2,5.13,5.13,5.13,5.43,6.94,7.56,7.9]
[3,5.13,5.13,5.22,5.92,7.98,8.64,8.9499999999999993]
[4,5.13,5.13,5.43,6.88,9.17,9.8699999999999992,10.18]
[5,5.13,5.17,5.71,7.63,10.26,10.93,11.57]
[6,5.17,5.43,6.22,8.33,11.43,12.24,12.85]
[7,5.43,5.55,6.74,9.11,12.85,13.67,14.12]
[8,5.43,6.05,7.22,9.89,14.18,15.11,15.53]
[9,5.43,6.3,7.78,10.62,15.45,16.52,17.07]
[10,5.69,6.71,8.3699999999999992,11.38,16.489999999999998,17.87,18.45]
[11,5.96,7.06,8.76,12.15,17.79,19.12,19.899999999999999]
[12,6.28,7.46,9.23,12.83,19.149999999999999,20.36,21.06]
[13,6.71,7.86,9.58,13.61,20.36,21.36,22.27]
[14,7,8.25,10.18,14.39,21.36,22.46,23.31]
[15,7.28,8.4600000000000009,10.7,14.91,22.46,23.46,24.36]
[16,7.46,8.74,11.16,15.42,23.46,24.64,25.41]
[17,7.71,9.01,11.62,16.149999999999999,24.52,25.95,26.6]
[18,7.96,9.31,12.09,16.71,25.89,27.1,28.16]
[19,8.25,9.57,12.43,17.39,26.85,28.56,29.45]
[20,8.5500000000000007,9.98,12.91,18.21,27.81,29.77,30.51]
[21,8.98,10.37,13.37,18.809999999999999,28.81,30.76,31.89]
[22,9.2200000000000006,10.85,13.75,19.350000000000001,29.76,31.95,33.11]
[23,9.4499999999999993,11.09,14.25,19.899999999999999,30.76,33.01,34.340000000000003]
[24,9.68,11.52,14.68,20.65,31.89,34.28,35.56]
[25,9.98,11.85,15.01,21.39,32.96,35.520000000000003,36.79]
[26,10.26,12.17,15.53,22.06,34.07,36.71,37.78]
[27,10.6,12.53,15.93,22.83,35.229999999999997,37.78,38.979999999999997]
[28,10.93,12.97,16.27,23.41,36.11,38.9,39.94]
[29,11.23,13.19,16.78,23.94,37.119999999999997,39.93,41.1]
[30,11.45,13.55,17.36,24.69,38.11,40.98,42.15]
[31,11.77,13.99,17.829999999999998,25.28,38.979999999999997,41.89,43.24]
[32,11.96,14.29,18.36,25.88,40.090000000000003,43.02,44.32]
[33,12.29,14.65,18.829999999999998,26.41,41.18,44.03,45.41]
[34,12.68,14.91,19.239999999999998,27.36,42.44,45.09,46.55]
[35,12.95,15.38,19.66,27.91,43.7,46.24,47.68]
[36,13.11,15.74,20.03,28.48,44.87,47.68,48.9]
[37,13.35,15.95,20.54,29.21,46.1,48.96,50.21]
[38,13.61,16.21,21.05,29.81,47.27,50.25,51.56]
[39,14.02,16.62,21.41,30.38,48.32,51.56,52.93]
[40,14.39,17.04,21.91,31.08,49.48,52.64,54.1]
[41,14.77,17.440000000000001,22.16,31.67,50.53,53.62,55.55]
[42,15.01,17.899999999999999,22.62,32.31,51.57,54.69,56.94]
[43,15.33,18.28,22.96,32.840000000000003,52.46,55.66,58.11]
[44,15.58,18.489999999999998,23.47,33.44,53.49,56.73,59.27]
[45,15.93,18.940000000000001,23.8,33.909999999999997,54.54,57.8,60.16]
[46,16.14,19.149999999999999,24.29,34.42,55.6,58.77,61.6]
[47,16.489999999999998,19.53,24.73,34.89,56.66,58.93,62.75]
[48,16.78,19.989999999999998,25.17,35.42,57.76,61.03,63.76]
[49,17.11,20.45,25.6,36.03,58.62,61.84,64.319999999999993]
[50,17.38,20.72,26,36.64,59.65,62.05,64.39]

{"sheet":"FxExpress Saver","index":22,"n_rows":59,"n_cols":8,"rows_kept":59,"cut":false,"hidden":true,"merged":[]}
["2016 NASPO Comparison",null,null,null,null,null,"Express Saver"]
[]
[null,"FedEx   Express Saver"]
[]
[null,"FedEx "]
[null,2,3,4,5,6,7,8]
[0.5,"**","**","**","**","**","**","**"]
["PAK1",4.88,4.88,4.88,4.97,5.28,5.56,6.15]
["PAK2",4.88,4.88,4.88,5.17,6,6.48,7.16]
[1,4.88,4.88,4.88,4.97,5.28,5.56,6.15]
[2,4.88,4.88,4.88,5.17,6,6.48,7.16]
[3,4.88,4.88,4.95,5.63,6.91,7.27,8.08]
[4,4.88,4.88,5.17,6.54,7.66,8.27,9.25]
[5,4.88,4.91,5.41,7.25,8.67,9.11,10.39]
[6,4.91,5.17,5.92,7.92,9.67,10.16,11.73]
[7,5.17,5.28,6.4,8.65,10.73,11.45,12.89]
[8,5.17,5.73,6.84,9.4,11.75,12.55,14.14]
[9,5.17,5.99,7.38,10.11,12.81,13.72,15.39]
[10,5.4,6.36,7.95,10.81,13.53,14.75,16.64]
[11,5.66,6.71,8.33,11.54,14.4,15.83,17.7]
[12,5.98,7.1,8.77,12.18,15.38,16.86,18.760000000000002]
[13,6.36,7.46,9.1,12.93,16.25,17.72,19.809999999999999]
[14,6.66,7.84,9.68,13.67,17.07,18.66,20.82]
[15,6.91,8.0399999999999991,10.16,14.18,17.989999999999998,19.45,21.75]
[16,7.1,8.31,10.58,14.66,18.739999999999998,20.41,22.7]
[17,7.32,8.56,11.05,15.34,19.420000000000002,21.45,23.87]
[18,7.56,8.82,11.48,15.89,20.079999999999998,22.47,25.16]
[19,7.84,9.08,11.8,16.55,20.8,23.46,26.07]
[20,8.14,9.4700000000000006,12.25,17.3,21.54,24.38,27.1]
[21,8.52,9.85,12.72,17.87,22.1,25.29,28.01]
[22,8.75,10.31,13.07,18.38,22.96,26.16,29.01]
[23,9,10.53,13.54,18.91,23.67,27,29.99]
[24,9.17,10.94,13.96,19.61,24.55,27.9,31.03]
[25,9.4700000000000006,11.25,14.25,20.32,25.29,28.9,32]
[26,9.76,11.56,14.75,20.96,26.13,29.83,32.94]
[27,10.08,11.91,15.15,21.7,27.07,30.88,34.01]
[28,10.38,12.31,15.46,22.23,27.99,31.85,35.04]
[29,10.67,12.52,15.94,22.74,28.74,32.75,36.159999999999997]
[30,10.88,12.88,16.5,23.47,29.71,33.619999999999997,37.18]
[31,11.18,13.28,16.95,24.02,30.6,34.64,38.24]
[32,11.38,13.58,17.420000000000002,24.59,31.37,35.58,39.299999999999997]
[33,11.66,13.92,17.89,25.1,32.22,36.46,40.32]
[34,12.05,14.18,18.28,26,33.119999999999997,37.409999999999997,41.53]
[35,12.3,14.62,18.68,26.51,33.86,38.299999999999997,42.5]
[36,12.46,14.94,19.02,27.06,34.75,39.090000000000003,43.51]
[37,12.69,15.17,19.510000000000002,27.74,35.47,39.909999999999997,44.47]
[38,12.93,15.4,20,28.32,36.21,40.64,45.33]
[39,13.31,15.8,20.34,28.86,37.049999999999997,41.43,46.21]
[40,13.67,16.2,20.81,29.53,37.869999999999997,42.23,47.04]
[41,14.03,16.579999999999998,21.06,30.07,38.51,43.08,48.08]
[42,14.25,17,21.5,30.68,39.33,44,49.06]
[43,14.55,17.350000000000001,21.81,31.2,40.06,44.98,50.2]
[44,14.81,17.57,22.28,31.76,40.909999999999997,45.91,51.29]
[45,15.15,17.98,22.61,32.200000000000003,41.68,46.89,52.31]
[46,15.33,18.2,23.09,32.700000000000003,42.5,47.78,53.53]
[47,15.65,18.55,23.49,33.15,43.51,48.77,54.69]
[48,15.94,18.989999999999998,23.9,33.630000000000003,44.52,49.7,55.75]
[49,16.260000000000002,19.43,24.3,34.229999999999997,45.57,50.76,56.89]
[50,16.52,19.7,24.69,34.79,46.47,51.8,57.93]