{"text_format":"1","workbook":"xlsx","n_sheets":23,"sheets":["SHELL","ZipLkup","Sheet1","ZIP-ZONES","LOOKUP","Ground Current","NDA Multi","ND Svr Multi","2DA Multi","2DA AM Multi","3DS Multi","GND E&I","PO E&I","SO E&I","E2AM","E2 E&I","ESP E&I","FX GND","FX PO","FX STD","Fx2DA AM","Fx2DAY Air","FxExpress Saver"],"not_rendered":{"charts":0,"images":5,"macros":1,"external_links":0,"defined_names":2,"comments":0,"pivot_tables":0},"unopened":[],"bounds":{"document_bytes":16777216,"sheet_cells":100000,"rows_first":2000,"rows_last":500,"rows_between":2000,"halvings":0,"cell_chars":16384,"cell_head_chars":4096},"cells_cut":0,"cells_raw":0,"read":"whole","date_system":"1900"}

{"sheet":"SHELL","index":0,"n_rows":30,"n_cols":12,"rows_kept":30,"cut":false,"hidden":false,"merged":[[0,0,1,12],[2,0,5,11]]}
["Cost Comparison FedEx E & I, UPS Contract, FedEx Contract Rates"]
[]
["Lowest Prices Highlighted in Yellow                           ** Services Not Available"]
[]
[]
[]
[]
[null,null,"Zone 2","Zone 6",null,"Zone 2","Zone 6",null,"Zone 2","Zone 6"]
["Priority",null,"FedEx",null,null,"UPS",null,null,"FedEx",null,"DHL"]
["Overnite",null,"E & I",null,null,"Contract",null,null,"Contract",null,"International"]
{"$rows_left_out":21}
{"sheet":"ZipLkup","index":1,"n_rows":952,"n_cols":2,"rows_kept":952,"cut":false,"hidden":true,"merged":[]}
[4,6]
[5,6]
[6,5]
[7,5]
[9,5]
[10,6]
[11,6]
[12,6]
[13,6]
[14,6]
{"$rows_left_out":943}
{"sheet":"Sheet1","index":2,"n_rows":952,"n_cols":4,"rows_kept":952,"cut":false,"hidden":true,"merged":[]}
[6,2,null,6]
[5,2,null,6]
[5,1,null,5]
[6,34,null,5]
[7,1,null,5]
[6,1,null,6]
[7,3,null,6]
[6,41,null,6]
[6,40,null,6]
[5,8,null,6]
{"$rows_left_out":943}
{"sheet":"ZIP-ZONES","index":3,"n_rows":209,"n_cols":6,"rows_kept":209,"cut":false,"hidden":true,"merged":[]}
["FEDEXGND ZIP-ZONES",null,null,null,"UPS ZIP-ZONES"]
[]
["000-004",6,null,null,"004-005",6]
["005",6,null,null,"006-007",5]
["010-043",6,null,null,"009",5]
["044",7,null,null,"010-043",6]
["045",6,null,null,"044",7]
["046-048",7,null,null,45,6]
["049-139",6,null,null,"046-048",7]
["140-147",5,null,null,"049-089",6]
{"$rows_left_out":200}
{"sheet":"LOOKUP","index":4,"n_rows":36,"n_cols":16,"rows_kept":36,"cut":false,"hidden":false,"merged":[[0,7,3,15],[24,13,27,13],[30,0,30,6]]}
[null,null,null,null,null,null,null,"Ups, Fedex E & I and Fedex Contract Rate Comparision are Basic Rates. Not included are Extended Area Surcharge, Fuel Surcharge or Additional Handling charges.                                                                                                            UPS and Fedex Zone Charts are for Days in Transit Comparision Only."]
[]
["Invalid = Service not available"]
[]
["USE 1ST 3 NO. OF ZIP CODE",727]
["INPUT Weight",1,"Letter = .5"]
["UPS Zone",{"$f":"INDEX('ZIP-ZONES'!$F$3:$F$136,MATCH($B$5,0+LEFT('ZIP-ZONES'!$E$3:$E$136,3),1))","v":2}]
["FEDEX ZONE",{"$f":"INDEX('ZIP-ZONES'!$B$3:$B$209,MATCH($B$5,0+LEFT('ZIP-ZONES'!$A$3:$A$209,3),1))","v":2}]
[null,{"$f":"IFERROR(IF(B6>=F17,VLOOKUP(B6,'Ground Current'!A7:K156,B7),VLOOKUP(F17,'Ground Current'!A7:K156,B7)),\"**\")","v":3.5394000000000001},{"$f":"IFERROR(IF(B6>=F17,VLOOKUP(B6,'NDA Multi'!A6:K156,B7),VLOOKUP(F17,'NDA Multi'!A6:K156,B7)),\"**\")","v":5.8343999999999996},{"$f":"IFERROR(IF((B6>=F17),VLOOKUP(B6,'ND Svr Multi'!A6:H156,B7),VLOOKUP(F17,'ND Svr Multi'!J6:Q156,B7)),\"**\")","v":5.7834000000000003},{"$f":"IFERROR(IF((B6>=F17),VLOOKUP(B6,'2DA AM Multi'!A6:H156,B7),VLOOKUP(F17,'2DA AM Multi'!A6:H156,B7)),\"**\")","v":5.6916000000000002},{"$f":"IFERROR(IF(B6>=F17,VLOOKUP(B6,'2DA Multi'!A6:K156,B7),VLOOKUP(F17,'2DA Multi'!A6:K156,B7)),\"**\")","v":4.8449999999999998},{"$f":"IFERROR(IF(B6>=F17,VLOOKUP(B6,'3DS Multi'!A7:H156,B7),VLOOKUP(F17,'3DS Multi'!A7:H156,B7)),\"**\")","v":4.7940000000000005}]
["UPS RATES","GND","NDA","ND Svr","2DA AM","2 DA","3DS"]
{"$rows_left_out":27}
{"sheet":"Ground Current","index":5,"n_rows":156,"n_cols":23,"rows_kept":156,"cut":false,"hidden":true,"merged":[[2,22,3,22],[2,8,3,8],[2,9,3,9],[2,10,3,10],[2,20,3,20],[2,21,3,21]]}
["UPS Ground Service",null,null,null,null,null,null,null,null,null,null,null,{"$f":"M1:X89UPS Ground Service","v":{"$error":"#NAME?"}},null,null,null,"Residential Surcharge",null,null,1.34]
["- Commercial",null,null,null,null,null,null,null,null,null,null,null,"- Residential"]
["(Per Package Rates from 48 State Origin)",null,null,null,null,null,null,null,"Metro AK & HI","PR","Remote AK",null,"(Per Package Rates from 48 State Origin)",null,null,null,null,null,null,null,"Metro AK & HI","PR","Remote AK"]
["Rates below do not include Residential Surcharge",null,null,null,null,null,null,null,null,null,null,null,"Rates Include Residential Surcharge"]
[null,2,3,4,5,6,7,8,"Zone 44","Zone 45","Zone 46",null,"Lbs.",2,3,4,5,6,7,8,"Zone 44","Zone 45","Zone 46"]
["","","","","","","","","","","",null,"","","","","","","","","","",""]
[1,3.5394000000000001,3.5394000000000001,3.5394000000000001,3.5394000000000001,3.5394000000000001,3.5802,3.6821999999999999,15.514200000000001,14.953200000000001,15.514200000000001,null,1,4.8794000000000004,4.8794000000000004,4.8794000000000004,4.8794000000000004,4.8794000000000004,4.9202000000000004,5.0221999999999998,16.854200000000002,16.293200000000002,16.854200000000002]
[2,3.5394000000000001,3.5394000000000001,3.5394000000000001,3.6516000000000002,3.8555999999999999,3.8555999999999999,3.8555999999999999,17.227800000000002,16.605600000000003,17.227800000000002,null,2,4.8794000000000004,4.8794000000000004,4.8794000000000004,4.9916,5.1955999999999998,5.1955999999999998,5.1955999999999998,18.567800000000002,17.945600000000002,18.567800000000002]
[3,3.5394000000000001,3.5394000000000001,3.8454000000000002,3.8555999999999999,3.8555999999999999,3.8963999999999999,4.2023999999999999,18.788400000000003,18.094799999999999,18.788400000000003,null,3,4.8794000000000004,4.8794000000000004,5.1854000000000005,5.1955999999999998,5.1955999999999998,5.2363999999999997,5.5423999999999998,20.128400000000003,19.434799999999999,20.128400000000003]
[4,3.5394000000000001,3.5394000000000001,3.8555999999999999,3.8555999999999999,3.9882000000000004,4.1106000000000007,4.4777999999999993,20.532599999999999,19.777799999999999,20.532599999999999,null,4,4.8794000000000004,4.8794000000000004,5.1955999999999998,5.1955999999999998,5.3282000000000007,5.4506000000000006,5.8177999999999992,21.872599999999998,21.117799999999999,21.872599999999998]
{"$rows_left_out":147}
{"sheet":"NDA Multi","index":6,"n_rows":156,"n_cols":23,"rows_kept":156,"cut":false,"hidden":true,"merged":[[0,8,0,9],[0,16,0,18],[0,20,0,21]]}
["UPS Next Day Air Service",null,null,null,null,null,null,null,null,null,null,null,"UPS Next Day Air Service",null,null,null,"Residential Surcharge",null,null,1.59]
["- Commercial",null,null,null,null,null,null,null,null,null,null,null,"-Residential"]
["(Per Package Rates from 48 State Origin)",null,null,null,null,null,null,null,null,null,null,null,"(Per Package Rates from 48 State Origin)"]
["Rates below do not include Residential Surcharge",null,null,null,null,null,null,null,null,null,null,null,"Rates Include Residential Surcharge"]
["Lbs.",2,3,4,5,6,7,8,"Zone 124","Zone 125","Zone 126",null,"Lbs.",2,3,4,5,6,7,8,"Zone 124","Zone 125","Zone 126"]
[0.5,5.8242000000000003,5.8242000000000003,6.7014000000000005,7.2114000000000003,7.2725999999999997,8.0069999999999997,8.1395999999999997,8.67,8.67,9.1085999999999991,null,0.5,7.4142000000000001,7.4142000000000001,8.2914000000000012,8.801400000000001,8.8626000000000005,9.5969999999999995,9.7295999999999996,10.26,10.26,10.698599999999999]
[1,5.8343999999999996,7.8234000000000004,9.9960000000000004,11.0976,12.046200000000001,12.872399999999999,13.2294,13.616999999999999,13.616999999999999,13.6374,null,1,7.4243999999999994,9.4134000000000011,11.586,12.6876,13.636200000000001,14.462399999999999,14.8194,15.206999999999999,15.206999999999999,15.227399999999999]
[2,5.9567999999999994,8.4455999999999989,11.2608,12.280799999999999,13.616999999999999,14.1882,14.769600000000001,14.871600000000001,14.871600000000001,14.8818,null,2,7.5467999999999993,10.035599999999999,12.8508,13.870799999999999,15.206999999999999,15.7782,16.3596,16.461600000000001,16.461600000000001,16.471800000000002]
[3,6.7014000000000005,9.0473999999999997,12.474600000000001,13.6068,15.085799999999999,15.595799999999999,16.146599999999999,16.595399999999998,16.595399999999998,18.625200000000003,null,3,8.2914000000000012,10.6374,14.0646,15.1968,16.675799999999999,17.1858,17.736599999999999,18.185399999999998,18.185399999999998,20.215200000000003]
[4,7.2317999999999998,9.4860000000000007,13.5252,14.8818,16.472999999999999,16.982999999999997,17.646000000000001,18.125399999999999,18.125399999999999,20.308199999999999,null,4,8.8217999999999996,11.076000000000001,15.1152,16.471800000000002,18.062999999999999,18.572999999999997,19.236000000000001,19.715399999999999,19.715399999999999,21.898199999999999]
{"$rows_left_out":147}
{"sheet":"ND Svr Multi","index":7,"n_rows":156,"n_cols":17,"rows_kept":156,"cut":false,"hidden":true,"merged":[[0,6,0,7],[0,13,0,15]]}
["UPS Next Day Saver Service",null,null,null,null,null,null,null,null,"UPS Next Day Saver Service",null,null,null,"Residential Surcharge",null,null,1.59]
["- Commercial",null,null,null,null,null,null,null,null,"- Residential"]
["(Per Package Rates from 48 State Origin)",null,null,null,null,null,null,null,null,"(Per Package Rates from 48 State Origin)"]
["Rates below do not include Residential Surcharge",null,null,null,null,null,null,null,null,"Rates Include Residential Surcharge"]
["Lbs.",2,3,4,5,6,7,8,null,"Lbs.",2,3,4,5,6,7,8]
[0.5,5.8140000000000001,5.8140000000000001,6.7932000000000006,7.3133999999999997,7.3746,8.1294000000000004,8.2620000000000005,null,0.5,7.4039999999999999,7.4039999999999999,8.3832000000000004,8.9033999999999995,8.9646000000000008,9.7194000000000003,9.8520000000000003]
[1,5.7834000000000003,5.8650000000000002,7.2930000000000001,7.7316000000000003,7.7825999999999995,8.2721999999999998,8.710799999999999,null,1,7.3734000000000002,7.4550000000000001,8.8830000000000009,9.3216000000000001,9.3726000000000003,9.8621999999999996,10.300799999999999]
[2,5.8650000000000002,6.6606000000000005,8.5373999999999999,9.4553999999999991,10.2714,10.954800000000001,11.250599999999999,null,2,7.4550000000000001,8.2506000000000004,10.1274,11.045399999999999,11.8614,12.5448,12.840599999999998]
[3,5.8650000000000002,7.0482000000000005,9.6288,10.465199999999999,11.597399999999999,12.0564,12.5664,null,3,7.4550000000000001,8.6382000000000012,11.2188,12.055199999999999,13.187399999999998,13.6464,14.1564]
[4,5.8650000000000002,7.4664000000000001,10.6488,11.597399999999999,12.8622,13.26,13.718999999999999,null,4,7.4550000000000001,9.0564,12.238799999999999,13.187399999999998,14.452199999999999,14.85,15.308999999999999]
{"$rows_left_out":147}
{"sheet":"2DA Multi","index":8,"n_rows":156,"n_cols":23,"rows_kept":156,"cut":false,"hidden":true,"merged":[[0,8,0,9],[0,20,0,21],[1,17,1,19]]}
["UPS Second Day Air Service",null,null,null,null,null,null,null,null,null,null,null,"UPS Second Day Air Service"]
["- Commercial",null,null,null,null,null,null,null,null,null,null,null,"- Residential",null,null,null,null,"Residential Surcharge",null,null,1.59]
["(Per Package Rates from 48 State Origin)",null,null,null,null,null,null,null,null,null,null,null,"(Per Package Rates from 48 State Origin)"]
["Rates below do not include Residential Surcharge",null,null,null,null,null,null,null,null,null,null,null,"Rates Include Residential Surcharge"]
["Lbs.",2,3,4,5,6,7,8,"Zone 224","Zone 225","Zone 226",null,"Lbs.",2,3,4,5,6,7,8,"Zone 224","Zone 225","Zone 226"]
[0.5,4.7940000000000005,4.7940000000000005,4.7940000000000005,4.7940000000000005,5.8343999999999996,6.0792000000000002,6.1301999999999994,9.8634000000000004,9.8634000000000004,10.975199999999999,null,0.5,6.3840000000000003,6.3840000000000003,6.3840000000000003,6.3840000000000003,7.4243999999999994,7.6692,7.7201999999999993,7.9955999999999996,8.2677214285714307,8.53984285714286]
[1,4.8449999999999998,4.8449999999999998,4.8449999999999998,4.8449999999999998,5.7630000000000008,6.0282,6.12,9.4451999999999998,9.4451999999999998,10.087800000000001,null,1,6.4349999999999996,6.4349999999999996,6.4349999999999996,6.4349999999999996,7.3530000000000006,7.6181999999999999,7.71,7.9329428571428604,8.1868499999999997,8.4407571428571497]
[2,4.8449999999999998,4.8449999999999998,4.8449999999999998,5.1101999999999999,6.3647999999999998,6.9257999999999997,7.2216000000000005,10.546799999999999,10.546799999999999,12.4848,null,2,6.4349999999999996,6.4349999999999996,6.4349999999999996,6.7001999999999997,7.9547999999999996,8.5158000000000005,8.8116000000000003,9.1569428571428606,9.6144857142857205,10.0720285714286]
[3,4.8449999999999998,4.8449999999999998,4.8449999999999998,5.5998000000000001,7.3133999999999997,8.0375999999999994,8.2926000000000002,12.036000000000001,12.036000000000001,13.0458,null,3,6.4349999999999996,6.4349999999999996,6.4349999999999996,7.1898,8.9033999999999995,9.6275999999999993,9.8826000000000001,10.586399999999999,11.2719857142857,11.9575714285714]
[4,4.8449999999999998,4.8449999999999998,4.9061999999999992,6.5280000000000005,8.4455999999999989,9.1596000000000011,9.4553999999999991,12.841799999999999,12.841799999999999,13.7088,null,4,6.4349999999999996,6.4349999999999996,6.4961999999999991,8.1180000000000003,10.035599999999999,10.749600000000001,11.045399999999999,12.187799999999999,13.116364285714299,14.044928571428599]
{"$rows_left_out":147}
{"sheet":"2DA AM Multi","index":9,"n_rows":156,"n_cols":8,"rows_kept":156,"cut":false,"hidden":true,"merged":[[0,6,0,7]]}
["UPS Second Day Air AM Service"]
["- Commercial"]
["(Per Package Rates from 48 State Origin)"]
["-Second Day Air A.M. does not have a Residential option"]
["Lbs.",2,3,4,5,6,7,8]
[0.5,5.6406000000000001,5.6406000000000001,5.6406000000000001,6.2627999999999995,7.7519999999999998,8.0784000000000002,8.16]
[1,5.6916000000000002,5.6916000000000002,5.6916000000000002,5.6916000000000002,6.9053999999999993,7.2216000000000005,7.3338000000000001]
[2,5.6916000000000002,5.6916000000000002,5.6916000000000002,5.8548,7.6296000000000008,8.2926000000000002,8.6598000000000006]
[3,5.6916000000000002,5.6916000000000002,5.6916000000000002,6.4361999999999995,8.7617999999999991,9.6083999999999996,9.9450000000000003]
[4,5.6916000000000002,5.6916000000000002,5.6916000000000002,7.4867999999999997,10.118399999999999,10.975199999999999,11.321999999999999]
{"$rows_left_out":147}
{"sheet":"3DS Multi","index":10,"n_rows":156,"n_cols":17,"rows_kept":156,"cut":false,"hidden":true,"merged":[[0,9,0,14],[1,6,1,7],[1,14,1,16]]}
[null,null,null,null,null,null,null,null,null,"Residential Surcharge",null,null,null,null,null,1.59]
["UPS Three Day Select Service",null,null,null,null,null,null,null,null,"UPS Three Day Select Service"]
["- Commercial",null,null,null,null,null,null,null,null,"- Residential"]
["(Per Package Rates from 48 State Origin)",null,null,null,null,null,null,null,null,"(Per Package Rates from 48 State Origin)"]
["Rates below do not include Residential Surcharge",null,null,null,null,null,null,null,null,"Rates Include Residential Surcharge"]
["Lbs.",2,3,4,5,6,7,8,null,"Lbs.",2,3,4,5,6,7,8]
[1,4.7940000000000005,4.7940000000000005,4.7940000000000005,4.7940000000000005,5.1203999999999992,5.7527999999999997,5.9466000000000001,null,1,6.3840000000000003,6.3840000000000003,6.3840000000000003,6.3840000000000003,6.710399999999999,7.3427999999999995,7.5366]
[2,4.7940000000000005,4.7940000000000005,4.7940000000000005,4.7940000000000005,5.9466000000000001,6.4260000000000002,6.9461999999999993,null,2,6.3840000000000003,6.3840000000000003,6.3840000000000003,6.3840000000000003,7.5366,8.016,8.5361999999999991]
[3,4.7940000000000005,4.7940000000000005,4.7940000000000005,4.9980000000000002,6.7422000000000004,7.3133999999999997,7.9253999999999998,null,3,6.3840000000000003,6.3840000000000003,6.3840000000000003,6.5880000000000001,8.3322000000000003,8.9033999999999995,9.5153999999999996]
[4,4.7940000000000005,4.7940000000000005,4.7940000000000005,5.5793999999999997,7.5275999999999996,8.2721999999999998,8.8230000000000004,null,4,6.3840000000000003,6.3840000000000003,6.3840000000000003,7.1693999999999996,9.1175999999999995,9.8621999999999996,10.413]
{"$rows_left_out":147}
{"sheet":"GND E&I","index":11,"n_rows":160,"n_cols":8,"rows_kept":160,"cut":false,"hidden":true,"merged":[[6,0,6,15]]}
[]
[]
[]
[]
[]
[]
["FedEx Continental U.S. Ground "]
["Weight","Packages Weighing 1-50 Pounds"]
["Not To","Continental U.S. Ground"]
["Exceed",2,3,4,5,6,7,8]
{"$rows_left_out":151}
{"sheet":"PO E&I","index":12,"n_rows":150,"n_cols":16,"rows_kept":150,"cut":false,"hidden":true,"merged":[]}
[" FedEx Priority Overnight"]
["E&I Contract Zone Rates"]
[null,"Guaranteed delivery by 10:30 a.m. by Next Day"]
[]
["LBS",2,3,4,5,6,7,8,9,10,11,12,13,14,15,16]
[0.5,8.509999999999998,8.509999999999998,8.86,9.4399999999999977,9.4500000000000028,10.640000000000004,10.819999999999997,12.369999999999997,12.369999999999997,13.670000000000002,13.670000000000002,8.509999999999998,8.509999999999998,8.509999999999998,8.509999999999998]
["PAK1",8.870000000000001,10.220000000000002,13.370000000000001,14.830000000000005,15.620000000000005,17.229999999999997,17.699999999999996,19.459999999999994,19.459999999999994,19.649999999999999,19.649999999999999,12.540000000000003,12.540000000000003,12.540000000000003,12.540000000000003]
["PAK2",8.870000000000001,11.129999999999999,14.600000000000001,15.93,17.669999999999995,18.409999999999997,19.770000000000003,21.340000000000003,21.340000000000003,21.57,21.57,13.360000000000003,13.360000000000003,13.360000000000003,13.360000000000003]
[1,8.870000000000001,10.220000000000002,13.370000000000001,14.830000000000005,15.620000000000005,17.229999999999997,17.699999999999996,19.459999999999994,19.459999999999994,19.649999999999999,19.649999999999999,12.540000000000003,12.540000000000003,12.540000000000003,12.540000000000003]
[2,8.870000000000001,11.129999999999999,14.600000000000001,15.93,17.669999999999995,18.409999999999997,19.770000000000003,21.340000000000003,21.340000000000003,21.57,21.57,13.360000000000003,13.360000000000003,13.360000000000003,13.360000000000003]
{"$rows_left_out":141}
{"sheet":"SO E&I","index":13,"n_rows":159,"n_cols":13,"rows_kept":159,"cut":false,"hidden":true,"merged":[]}
[" FedEx Standard Overnight"]
["E&I Contract Zone Rates"]
[null,"Guaranteed delivery by  3 p.m. by Next Day"]
[]
[]
["Weight (in Lbs)",2,3,4,5,6,7,8,9,13,14,15,16]
[0.5,8.4299999999999979,8.4299999999999979,8.5100000000000016,9.09,9.1500000000000021,9.740000000000002,10.189999999999998,11.539999999999996,8.4299999999999979,8.4299999999999979,8.4299999999999979,8.4299999999999979]
["PAK1",8.6100000000000012,8.73,12.170000000000002,13.130000000000003,14.259999999999998,15.189999999999998,15.93,16.5,9.9200000000000017,9.9200000000000017,9.9200000000000017,9.9200000000000017]
["PAK2",8.6100000000000012,9.240000000000002,13.719999999999999,14.530000000000001,16.100000000000001,16.75,17.770000000000003,18.550000000000004,10.219999999999999,10.219999999999999,10.219999999999999,10.219999999999999]
[1,8.6100000000000012,8.73,12.170000000000002,13.130000000000003,14.259999999999998,15.189999999999998,15.93,16.5,9.9200000000000017,9.9200000000000017,9.9200000000000017,9.9200000000000017]
{"$rows_left_out":150}
{"sheet":"E2AM","index":14,"n_rows":164,"n_cols":11,"rows_kept":164,"cut":false,"hidden":true,"merged":[]}
[]
[]
[]
[]
[]
[]
[]
[" FedEx 2Day AM"]
["E&I Contract Zone Rates"]
[null,"Guaranteed delivery by 10:30 a.m. by 2nd Day"]
{"$rows_left_out":155}
{"sheet":"E2 E&I","index":15,"n_rows":166,"n_cols":16,"rows_kept":166,"cut":false,"hidden":true,"merged":[]}
[]
[]
[]
[]
[]
[]
[]
[" FedEx 2Day"]
["E&I Contract Zone Rates"]
[null,"Guaranteed delivery by 4:30 p.m. by 2nd Day"]
{"$rows_left_out":157}
{"sheet":"ESP E&I","index":16,"n_rows":166,"n_cols":8,"rows_kept":166,"cut":false,"hidden":true,"merged":[]}
[]
[]
[]
[]
[]
[]
[]
[" FedEx Express Saver"]
["E&I Contract Zone Rates"]
[null,"Guaranteed delivery by 4:30 by 3rd Day"]
{"$rows_left_out":157}
{"sheet":"FX GND","index":17,"n_rows":156,"n_cols":8,"rows_kept":156,"cut":false,"hidden":true,"merged":[[0,6,0,7]]}
["2016 NASPO Comparison",null,null,null,null,null,"Ground"]
[]
[null,"Ground"]
[]
[]
["Lbs.",2,3,4,5,6,7,8]
[1,3.7,3.71,3.72,3.73,3.76,3.83,3.94]
[2,3.71,3.72,3.76,3.9,4.13,4.13,4.13]
[3,3.72,3.73,4.12,4.13,4.13,4.18,4.5]
[4,3.73,3.75,4.13,4.13,4.2699999999999996,4.4000000000000004,4.79]
{"$rows_left_out":147}
{"sheet":"FX PO","index":18,"n_rows":60,"n_cols":8,"rows_kept":60,"cut":false,"hidden":true,"merged":[]}
["2016 NASPO Comparison",null,null,null,null,null,"Priority Overnight"]
[]
[]
[]
[]
[null,"FedEx"]
[null,2,3,4,5,6,7,8]
[0.5,6.24,6.44,7.46,7.87,8.08,8.7100000000000009,9.01]
["PAK1",6.3,8.3699999999999992,10.5,11.65,12.63,13.49,13.87]
["PAK2",6.44,9.1,11.83,12.89,14.3,14.86,15.46]
{"$rows_left_out":51}
{"sheet":"FX STD","index":19,"n_rows":59,"n_cols":8,"rows_kept":59,"cut":false,"hidden":true,"merged":[]}
["2016 NASPO Comparison",null,null,null,null,null,"Standard Overnight"]
[]
[null,"FedEx Standard Overnight"]
[]
[null,"FedEx  "]
[null,2,3,4,5,6,7,8]
[0.5,5.85,5.96,6.95,7.33,7.38,7.85,8.24]
["PAK1",5.96,6.93,9.2200000000000006,10.220000000000001,11.09,11.84,12.17]
["PAK2",6.01,7.34,10.39,11.3,12.52,13.05,13.57]
[1,5.96,6.93,9.2200000000000006,10.220000000000001,11.09,11.84,12.17]
{"$rows_left_out":50}
{"sheet":"Fx2DA AM","index":20,"n_rows":192,"n_cols":13,"rows_kept":192,"cut":false,"hidden":true,"merged":[[13,0,13,1],[0,0,1,1],[2,0,2,1],[3,0,3,1],[4,0,5,0],[6,0,6,1],[7,0,7,1],[8,0,8,1],[9,0,9,1],[10,0,10,1],[11,0,11,1],[12,0,12,1],[25,0,26,2],[27,0,27,2],[183,0,183,1],[14,0,14,1],[15,0,15,1],[16,0,16,1],[19,0,20,1],[22,0,23,1],[22,2,23,2]]}
["Express Rates"]
[]
["Created On: 03/27/2017 10:52 AM CT"]
[]
["Customer Name: CAMPUS POST OFFICE ETC.","Account Number:"]
[null,156124192]
[]
["Note: The net rate sheets presented in this document are based on customer's discounts effective on 03/27/2017. The net rate sheets presented in this document are for your convenience only and are not intended to be a agreement or part of a agreement. Actual net rates may vary due to changes in customer's shipping pattern that affects the revenue thresholds used in the rate calculations. The customer may have additional pricing features on the agreement that is not captured in the net rates calculations presented in this document. Please review your agreement for complete details or contact your Account Executive for more information."]
[]
["Net rates may include applicable Earned Discounts, Ground Threshold Discounts and Bonus Discounts."]
{"$rows_left_out":183}
{"sheet":"Fx2DAY Air","index":21,"n_rows":59,"n_cols":8,"rows_kept":59,"cut":false,"hidden":true,"merged":[]}
["2016 NASPO Comparison",null,null,null,null,null,"2Day Air"]
[]
[null,"FedEx 2Day Express"]
[]
[null,"FedEx  "]
[null,2,3,4,5,6,7,8]
[0.5,5.13,5.13,5.13,5.25,6.19,6.48,6.53]
["PAK1",5.13,5.13,5.13,5.25,6.19,6.55,6.66]
["PAK2",5.13,5.13,5.13,5.43,6.94,7.56,7.9]
[1,5.13,5.13,5.13,5.25,6.19,6.55,6.66]
{"$rows_left_out":50}
{"sheet":"FxExpress Saver","index":22,"n_rows":59,"n_cols":8,"rows_kept":59,"cut":false,"hidden":true,"merged":[]}
["2016 NASPO Comparison",null,null,null,null,null,"Express Saver"]
[]
[null,"FedEx   Express Saver"]
[]
[null,"FedEx "]
[null,2,3,4,5,6,7,8]
[0.5,"**","**","**","**","**","**","**"]
["PAK1",4.88,4.88,4.88,4.97,5.28,5.56,6.15]
["PAK2",4.88,4.88,4.88,5.17,6,6.48,7.16]
[1,4.88,4.88,4.88,4.97,5.28,5.56,6.15]
{"$rows_left_out":49}